{"text_format":"3","workbook":"xlsx","n_sheets":3,"sheets":["Rheinland-Pfalz","außerhalb RLP - TN bis 15 Jahre","außerhalb RLP - TN ab 16 Jahre"],"not_rendered":{"images":1,"defined_names":3},"read":"whole","date_system":"1900"}

{"sheet":"Rheinland-Pfalz","index":0,"n_rows":504,"n_cols":81,"rows_kept":504,"merged":[[0,2,0,7],[0,12,0,14],[1,2,1,7],[2,2,2,7],[2,10,2,14],[3,2,3,7],[4,2,4,7],[5,3,5,7],[5,10,5,14],[6,3,6,7],[6,17,7,17],[7,2,7,7],[7,9,7,14],[8,0,8,7],[8,11,9,14],[8,16,9,16],[8,17,9,17],[9,0,9,10],[10,0,10,1]]}
["Schule:",{"$nulls":8},"Kenn-Nr.:",null,".",{"$nulls":4},{"$f":"IF(ISBLANK(K1),\"Bitte Kenn-Nr. eintragen!\",\"\")","v":"Bitte Kenn-Nr. eintragen!"},{"$nulls":52},"Anrede",null,"Wertung",{"$nulls":6},"Preisstaffelung"]
["Zusatzangabe:",{"$nulls":9},{"$f":"IF(ISBLANK(K3),\"Bitte Schulart eintragen!\",\"\")","v":"Bitte Schulart eintragen!"},{"$nulls":5},{"$f":"IF(ISBLANK(R3),\"Bitte Datum eintragen!\",\"\")","v":"Bitte Datum eintragen!"},{"$nulls":52},"Frau",null,{"v":0,"d":"0.000"},"-",{"v":0.08,"d":"0.080"},1,{"$nulls":3},"ab",0,{"v":3,"d":"3.00 €"}]
["Straße/Hausnummer:",{"$nulls":8},"Schulart:",{"$nulls":6},"Datum:",{"$nulls":52},"Herr",null,{"v":0.0801,"d":"0.080"},"-",{"v":0.19,"d":"0.190"},2,{"$nulls":3},"ab",50,{"v":2.5,"d":"2.50 €"}]
["PLZ:",{"$nulls":8},"Anrede:","Vor-/Zuname der Lehrkraft",{"$nulls":3},{"$f":"IF(ISBLANK(R6),\"Bitte Tel.-Nr. für kurzfristige Rückfragen angeben!\",\"\")","v":"Bitte Tel.-Nr. für kurzfristige Rückfragen angeben!"},{"$nulls":56},{"v":0.1901,"d":"0.190"},"-",{"v":0.33,"d":"0.330"},3,{"$nulls":3},"ab",100,{"v":2,"d":"2.00 €"}]
["Ort:"]
["Telefon: (dienst.)",{"$nulls":15},"Tel.:(privat)",{"$nulls":54},{"v":0.3301,"d":"0.330"},"-",{"v":0.5,"d":"0.500"},4]
["Fax:",{"$nulls":8},"E-Mail:",{"$nulls":59},"Wert",null,{"v":0.5001,"d":"0.500"},"-",null,"TN"]
["Bundesland/Land:",null,"Rheinland-Pfalz",{"$nulls":13},"Anmerkungen",{"$nulls":54},"TN","=","Teilnahme"]
["nur für Schulen aus Rheinland-Pfalz",{"$nulls":10},"Gesamt",{"$nulls":3},{"$f":"SUM(P13:P504)","v":0},{"$f":"P9","v":0},"Wettschreib-Teilnehmer"]
["Teilnehmer außerhalb von RLP bitte Tabellenblatt \"TN unter 15 Jahre\" oder \"TN über 15 Jahre\" benutzen!"]
[{"$f":"H11+N11","v":0},null,"Punkte für die Schule",{"$f":"TODAY()","v":"2019-01-09"},"Landessprache",null,null,{"$f":"COUNT(F13:F504)","v":0},null,2019,"Fremdsprache",null,null,{"$f":"COUNT(L13:L504)","v":0},null,{"$f":"VLOOKUP(P9,CB2:CC4,2)","v":{"v":3,"d":"3.00 €"}},{"$f":"IF((P11*Q9)<10,10,P11*Q9)","v":{"v":10,"d":"10.00 €"}},"zu zahlender Gesamtbetrag"]
["Lfd.-Nr.","Nachname\nausgeschrieben","Vorname ausgeschrieben","Geburtsjahr\n4-stellig angeben","Gesamt-anschläge","Fehler","Minuten-An-schläge","Quotient","Note","ohne Alters-angabe\na. K.","Gesamt-anschläge","Fehler","Minuten-An-schläge","Quotient","Note","TN","Teilnehmer-Gebühr","sonstige schulinterne Angaben"]
[1,{"$nulls":5},{"$f":"IF(ISBLANK(E13),\"\",ROUNDDOWN(E13/10,0))","v":""},{"$f":"IF(ISBLANK(E13),\"\",F13*100/E13)","v":""},{"$f":"IF(ISBLANK(E13),\"\",VLOOKUP(H13,$BT$2:$BW$7,4))","v":""},{"$f":"IF(ISBLANK(D13),\"\",IF(AND($J$11-D13<25),$J$11-D13,\"a. K.\"))","v":""},null,null,{"$f":"IF(ISBLANK(K13),\"\",ROUNDDOWN(K13/10,0))","v":""},{"$f":"IF(ISBLANK(K13),\"\",L13*100/K13)","v":""},{"$f":"IF(ISBLANK(K13),\"\",VLOOKUP(N13,$BT$2:$BW$7,4))","v":""},{"$f":"IF(AND(B13<>\"\",C13<>\"\",OR(E13>0,K13>0)),1,0)","v":0},{"$f":"IF(P13,$P$11,\"\")","v":""},{"$nulls":52},"Werte",null,"Schulart:",null,null,"Land/Bundesland:"]
[{"$f":"IF(ISBLANK(B14),\"\",1+A13)","v":""},{"$nulls":5},{"$f":"IF(ISBLANK(E14),\"\",ROUNDDOWN(E14/10,0))","v":""},{"$f":"IF(ISBLANK(E14),\"\",F14*100/E14)","v":""},{"$f":"IF(ISBLANK(E14),\"\",VLOOKUP(H14,$BT$2:$BW$7,4))","v":""},{"$f":"IF(ISBLANK(D14),\"\",IF(AND($J$11-D14<25),$J$11-D14,\"a. K.\"))","v":""},null,null,{"$f":"IF(ISBLANK(K14),\"\",ROUNDDOWN(K14/10,0))","v":""},{"$f":"IF(ISBLANK(K14),\"\",L14*100/K14)","v":""},{"$f":"IF(ISBLANK(K14),\"\",VLOOKUP(N14,$BT$2:$BW$7,4))","v":""},{"$f":"IF(AND(B14<>\"\",C14<>\"\",OR(E14>0,K14>0)),1,0)","v":0},{"$f":"IF(P14,$P$11,\"\")","v":""},{"$nulls":52},10,null,"BBS/BFS",{"$nulls":5},"B         - Belgien"]
[{"$f":"IF(ISBLANK(B15),\"\",1+A14)","v":""},{"$nulls":5},"","","","",null,null,"","","",0,"",{"$nulls":52},11,null,"Gymnasium",{"$nulls":5},"BLN     - Berlin"]
[{"$f":"IF(ISBLANK(B16),\"\",1+A15)","v":""},{"$nulls":5},"","","","",null,null,"","","",0,"",{"$nulls":52},20,null,"Realschule+/IGS",{"$nulls":5},"BRA     - Brandenburg"]
["",{"$nulls":5},"","","","",null,null,"","","",0,"",{"$nulls":52},30,null,"Grundschule",{"$nulls":5},"BR       - Bremen"]
["",{"$nulls":5},"","","","",null,null,"","","",0,"",{"$nulls":52},40,null,"Förderschule",{"$nulls":5},"BW      - Baden-Württemberg"]
["",{"$nulls":5},"","","","",null,null,"","","",0,"",{"$nulls":52},50,null,"Verein",{"$nulls":5},"BY       - Bayern"]
["",{"$nulls":5},"","","",{"$f":"IF(ISBLANK(D20),\"\",IF(AND($J$11-D20<25),$J$11-D20,\"a. K.\"))","v":""},null,null,"","","",0,"",{"$nulls":54},"VHS",{"$nulls":5},"CH       - Schweiz"]
["",{"$nulls":5},"","","","",null,null,"","","",0,"",{"$nulls":54},"freier Bildungsträger",{"$nulls":5},"HE       - Hessen"]
["",{"$nulls":5},"","","","",null,null,"","","",0,"",{"$nulls":54},"Privatschule",{"$nulls":5},"HH       - Hamburg"]
["",{"$nulls":5},"","","","",null,null,"","","",0,"",{"$nulls":54},"Hauptschule",{"$nulls":5},"MEVO  - Mecklenburg-Vorpommern"]
["",{"$nulls":5},"","","","",null,null,"","","",0,"",{"$nulls":54},"Mittelschule",{"$nulls":5},"NI         - Niedersachsen"]
["",{"$nulls":5},"","","","",null,null,"","","",0,"",{"$nulls":54},"sonstige Schulart",{"$nulls":5},"NL        - Niederlande"]
["",{"$nulls":5},"","","","",null,null,"","","",0,"",{"$nulls":60},"NRW    - Nordrhein-Westfalen"]
["",{"$nulls":5},"","","","",null,null,"","","",0,"",{"$nulls":57},"Rheinland-Pfalz",null,null,"RLP      - Rheinland-Pfalz"]
["",{"$nulls":5},"","","","",null,null,"","","",0,"",{"$nulls":60},"SA        - Sachsen"]
["",{"$nulls":5},"","","","",null,null,"","","",0,"",{"$nulls":60},"SAAN   - Sachsen-Anhalt"]
["",{"$nulls":5},"","","","",null,null,"","","",0,"",{"$nulls":60},"SH       - Schleswig-Holstein"]
["",{"$nulls":5},"","","","",null,null,"","","",0,"",{"$nulls":60},"SL        - Saarland"]
["",{"$nulls":5},"","","","",null,null,"","","",0,"",{"$nulls":60},"TH       - Thüringen"]
["",{"$nulls":5},"","","","",null,null,"","","",0,"",{"$nulls":60},"So        - Sonstiges"]
["",{"$nulls":5},"","","","",null,null,"","","",0,"",{"$nulls":54},"Anrede:"]
["",{"$nulls":5},"","","","",null,null,"","","",0,"",{"$nulls":54},"Frau"]
["",{"$nulls":5},"","","","",null,null,"","","",0,"",{"$nulls":54},"Herr"]
["",{"$nulls":5},"","","","",null,null,"","","",0,""]
["",{"$nulls":5},"","","","",null,null,"","","",0,"",{"$nulls":54},"Schul-Kenn-Nr.:",null,"Schule in/außerhalb"]
["",{"$nulls":5},"","","","",null,null,"","","",0,"",{"$nulls":54},10,null,"Schulen in Rheinland-Pfalz"]
[{"$f":"IF(ISBLANK(B40),\"\",1+A39)","v":""},{"$nulls":5},"","","","",null,null,"","","",0,"",{"$nulls":56},"Schulen im Ausland"]
["",{"$nulls":5},"","","","",null,null,"","","",0,"",{"$nulls":56},"Schulen außerhalb von RLP"]
["",{"$nulls":5},"","","","",null,null,"","","",0,""]
["",{"$nulls":5},"","","","",null,null,"","","",0,""]
["",{"$nulls":5},"","","","",null,null,"","","",0,""]
["",{"$nulls":5},"","","","",null,null,"","","",0,""]
["",{"$nulls":5},"","","","",null,null,"","","",0,""]
["",{"$nulls":5},"","","","",null,null,"","","",0,""]
["",{"$nulls":5},"","","","",null,null,"","","",0,""]
["",{"$nulls":5},"","","","",null,null,"","","",0,"",{"$nulls":54},11,null,"BBS/BFS"]
["",{"$nulls":5},"","","","",null,null,"","","",0,"",{"$nulls":54},12,null,"Gymnasium"]
["",{"$nulls":5},"","","","",null,null,"","","",0,"",{"$nulls":54},13,null,"Realschule +/IGS"]
["",{"$nulls":5},"","","","",null,null,"","","",0,"",{"$nulls":54},14,null,"Grundschule - Primärstufe"]
["",{"$nulls":5},"","","","",null,null,"","","",0,"",{"$nulls":54},15,null,"Förderschule - motorischer Hintergrund"]
[{"$f":"IF(ISBLANK(B54),\"\",1+A53)","v":""},{"$nulls":5},"","","","",null,null,"","","",0,"",{"$nulls":54},16,null,"freie Bildungsträger"]
["",{"$nulls":5},"","","","",null,null,"","","",0,"",{"$nulls":54},17,null,"VHS - Erwachsenenbildung"]
["",{"$nulls":5},"","","","",null,null,"","","",0,"",{"$nulls":54},18,null,"Vereine"]
["",{"$nulls":5},"","","","",null,null,"","","",0,"",{"$nulls":54},19,null,"sonstige"]
["",{"$nulls":5},"","","","",null,null,"","","",0,""]
["",{"$nulls":5},"","","","",null,null,"","","",0,"",{"$nulls":54},21,null,"BBS/BFS"]
["",{"$nulls":5},"","","","",null,null,"","","",0,"",{"$nulls":54},22,null,"Gymnasium"]
["",{"$nulls":5},"","","","",null,null,"","","",0,"",{"$nulls":54},23,null,"Realschule +/IGS"]
["",{"$nulls":5},"","","","",null,null,"","","",0,"",{"$nulls":54},24,null,"Grundschule - Primärstufe"]
["",{"$nulls":5},"","","","",null,null,"","","",0,"",{"$nulls":54},25,null,"Förderschule - motorischer Hintergrund"]
["",{"$nulls":5},"","","","",null,null,"","","",0,"",{"$nulls":54},26,null,"freie Bildungsträger"]
["",{"$nulls":5},"","","","",null,null,"","","",0,"",{"$nulls":54},27,null,"VHS - Erwachsenenbildung"]
["",{"$nulls":5},"","","","",null,null,"","","",0,"",{"$nulls":54},28,null,"Vereine"]
["",{"$nulls":5},"","","","",null,null,"","","",0,"",{"$nulls":54},29,null,"sonstige"]
["",{"$nulls":5},"","","","",null,null,"","","",0,""]
["",{"$nulls":5},"","","","",null,null,"","","",0,"",{"$nulls":54},31,null,"BBS/BFS"]
["",{"$nulls":5},"","","","",null,null,"","","",0,"",{"$nulls":54},32,null,"Gymnasium"]
["",{"$nulls":5},"","","","",null,null,"","","",0,"",{"$nulls":54},33,null,"Realschule +/IGS"]
["",{"$nulls":5},"","","","",null,null,"","","",0,"",{"$nulls":54},34,null,"Grundschule - Primärstufe"]
["",{"$nulls":5},"","","","",null,null,"","","",0,"",{"$nulls":54},35,null,"Förderschule - motorischer Hintergrund"]
["",{"$nulls":5},"","","","",null,null,"","","",0,"",{"$nulls":54},36,null,"freie Bildungsträger"]
["",{"$nulls":5},"","","","",null,null,"","","",0,"",{"$nulls":54},37,null,"VHS - Erwachsenenbildung"]
["",{"$nulls":5},"","","","",null,null,"","","",0,"",{"$nulls":54},38,null,"Vereine"]
["",{"$nulls":5},"","","","",null,null,"","","",0,"",{"$nulls":54},39,null,"sonstige"]
["",{"$nulls":5},{"$f":"IF(ISBLANK(E78),\"\",ROUNDDOWN(E78/10,0))","v":""},{"$f":"IF(ISBLANK(E78),\"\",F78*100/E78)","v":""},{"$f":"IF(ISBLANK(E78),\"\",VLOOKUP(H78,$BT$2:$BW$7,4))","v":""},{"$f":"IF(ISBLANK(D78),\"\",IF(AND($J$11-D78<25),$J$11-D78,\"a. K.\"))","v":""},null,null,{"$f":"IF(ISBLANK(K78),\"\",ROUNDDOWN(K78/10,0))","v":""},{"$f":"IF(ISBLANK(K78),\"\",L78*100/K78)","v":""},{"$f":"IF(ISBLANK(K78),\"\",VLOOKUP(N78,$BT$2:$BW$7,4))","v":""},{"$f":"IF(AND(B78<>\"\",C78<>\"\",OR(E78>0,K78>0)),1,0)","v":0},{"$f":"IF(P78,$P$11,\"\")","v":""}]
["",{"$nulls":5},"","","","",null,null,"","","",0,""]
["",{"$nulls":5},"","","","",null,null,"","","",0,""]
["",{"$nulls":5},"","","","",null,null,"","","",0,""]
["",{"$nulls":5},"","","","",null,null,"","","",0,""]
["",{"$nulls":5},"","","","",null,null,"","","",0,""]
["",{"$nulls":5},"","","","",null,null,"","","",0,""]
["",{"$nulls":5},"","","","",null,null,"","","",0,""]
["",{"$nulls":5},"","","","",null,null,"","","",0,""]
["",{"$nulls":5},"","","","",null,null,"","","",0,""]
["",{"$nulls":5},"","","","",null,null,"","","",0,""]
["",{"$nulls":5},"","","","",null,null,"","","",0,""]
["",{"$nulls":5},"","","","",null,null,"","","",0,""]
["",{"$nulls":5},"","","","",null,null,"","","",0,""]
["",{"$nulls":5},"","","","",null,null,"","","",0,""]
["",{"$nulls":5},"","","","",null,null,"","","",0,""]
["",{"$nulls":5},"","","","",null,null,"","","",0,""]
["",{"$nulls":5},"","","","",null,null,"","","",0,""]
["",{"$nulls":5},"","","","",null,null,"","","",0,""]
["",{"$nulls":5},"","","","",null,null,"","","",0,""]
["",{"$nulls":5},"","","","",null,null,"","","",0,""]
["",{"$nulls":5},"","","","",null,null,"","","",0,""]
["",{"$nulls":5},"","","","",null,null,"","","",0,""]
["",{"$nulls":5},"","","","",null,null,"","","",0,""]
["",{"$nulls":5},"","","","",null,null,"","","",0,""]
["",{"$nulls":5},"","","","",null,null,"","","",0,""]
["",{"$nulls":5},"","","","",null,null,"","","",0,""]
["",{"$nulls":5},"","","","",null,null,"","","",0,""]
["",{"$nulls":5},"","","","",null,null,"","","",0,""]
["",{"$nulls":5},"","","","",null,null,"","","",0,""]
["",{"$nulls":5},"","","","",null,null,"","","",0,""]
["",{"$nulls":5},"","","","",null,null,"","","",0,""]
["",{"$nulls":5},"","","","",null,null,"","","",0,""]
["",{"$nulls":5},"","","","",null,null,"","","",0,""]
["",{"$nulls":5},"","","","",null,null,"","","",0,""]
["",{"$nulls":5},"","","","",null,null,"","","",0,""]
["",{"$nulls":5},"","","","",null,null,"","","",0,""]
["",{"$nulls":5},"","","","",null,null,"","","",0,""]
["",{"$nulls":5},"","","","",null,null,"","","",0,""]
["",{"$nulls":5},"","","","",null,null,"","","",0,""]
[{"$f":"IF(ISBLANK(B118),\"\",1+A117)","v":""},{"$nulls":5},"","","","",null,null,"","","",0,""]
["",{"$nulls":5},"","","","",null,null,"","","",0,""]
["",{"$nulls":5},"","","","",null,null,"","","",0,""]
["",{"$nulls":5},"","","","",null,null,"","","",0,""]
["",{"$nulls":5},"","","","",null,null,"","","",0,""]
["",{"$nulls":5},"","","","",null,null,"","","",0,""]
["",{"$nulls":5},"","","","",null,null,"","","",0,""]
["",{"$nulls":5},"","","","",null,null,"","","",0,""]
["",{"$nulls":5},"","","","",null,null,"","","",0,""]
["",{"$nulls":5},"","","","",null,null,"","","",0,""]
["",{"$nulls":5},"","","","",null,null,"","","",0,""]
["",{"$nulls":5},"","","","",null,null,"","","",0,""]
["",{"$nulls":5},"","","","",null,null,"","","",0,""]
["",{"$nulls":5},"","","","",null,null,"","","",0,""]
["",{"$nulls":5},"","","","",null,null,"","","",0,""]
["",{"$nulls":5},"","","","",null,null,"","","",0,""]
["",{"$nulls":5},"","","","",null,null,"","","",0,""]
["",{"$nulls":5},"","","","",null,null,"","","",0,""]
["",{"$nulls":5},"","","","",null,null,"","","",0,""]
["",{"$nulls":5},"","","","",null,null,"","","",0,""]
["",{"$nulls":5},"","","","",null,null,"","","",0,""]
["",{"$nulls":5},"","","","",null,null,"","","",0,""]
["",{"$nulls":5},"","","","",null,null,"","","",0,""]
["",{"$nulls":5},"","","","",null,null,"","","",0,""]
["",{"$nulls":5},{"$f":"IF(ISBLANK(E142),\"\",ROUNDDOWN(E142/10,0))","v":""},{"$f":"IF(ISBLANK(E142),\"\",F142*100/E142)","v":""},{"$f":"IF(ISBLANK(E142),\"\",VLOOKUP(H142,$BT$2:$BW$7,4))","v":""},{"$f":"IF(ISBLANK(D142),\"\",IF(AND($J$11-D142<25),$J$11-D142,\"a. K.\"))","v":""},null,null,{"$f":"IF(ISBLANK(K142),\"\",ROUNDDOWN(K142/10,0))","v":""},{"$f":"IF(ISBLANK(K142),\"\",L142*100/K142)","v":""},{"$f":"IF(ISBLANK(K142),\"\",VLOOKUP(N142,$BT$2:$BW$7,4))","v":""},{"$f":"IF(AND(B142<>\"\",C142<>\"\",OR(E142>0,K142>0)),1,0)","v":0},{"$f":"IF(P142,$P$11,\"\")","v":""}]
["",{"$nulls":5},"","","","",null,null,"","","",0,""]
["",{"$nulls":5},"","","","",null,null,"","","",0,""]
["",{"$nulls":5},"","","","",null,null,"","","",0,""]
["",{"$nulls":5},"","","","",null,null,"","","",0,""]
["",{"$nulls":5},"","","","",null,null,"","","",0,""]
["",{"$nulls":5},"","","","",null,null,"","","",0,""]
["",{"$nulls":5},"","","","",null,null,"","","",0,""]
["",{"$nulls":5},"","","","",null,null,"","","",0,""]
["",{"$nulls":5},"","","","",null,null,"","","",0,""]
["",{"$nulls":5},"","","","",null,null,"","","",0,""]
["",{"$nulls":5},"","","","",null,null,"","","",0,""]
["",{"$nulls":5},"","","","",null,null,"","","",0,""]
["",{"$nulls":5},"","","","",null,null,"","","",0,""]
["",{"$nulls":5},"","","","",null,null,"","","",0,""]
["",{"$nulls":5},"","","","",null,null,"","","",0,""]
["",{"$nulls":5},"","","","",null,null,"","","",0,""]
["",{"$nulls":5},"","","","",null,null,"","","",0,""]
["",{"$nulls":5},"","","","",null,null,"","","",0,""]
["",{"$nulls":5},"","","","",null,null,"","","",0,""]
["",{"$nulls":5},"","","","",null,null,"","","",0,""]
["",{"$nulls":5},"","","","",null,null,"","","",0,""]
["",{"$nulls":5},"","","","",null,null,"","","",0,""]
["",{"$nulls":5},"","","","",null,null,"","","",0,""]
["",{"$nulls":5},"","","","",null,null,"","","",0,""]
["",{"$nulls":5},"","","","",null,null,"","","",0,""]
["",{"$nulls":5},"","","","",null,null,"","","",0,""]
["",{"$nulls":5},"","","","",null,null,"","","",0,""]
["",{"$nulls":5},"","","","",null,null,"","","",0,""]
["",{"$nulls":5},"","","","",null,null,"","","",0,""]
["",{"$nulls":5},"","","","",null,null,"","","",0,""]
["",{"$nulls":5},"","","","",null,null,"","","",0,""]
["",{"$nulls":5},"","","","",null,null,"","","",0,""]
["",{"$nulls":5},"","","","",null,null,"","","",0,""]
["",{"$nulls":5},"","","","",null,null,"","","",0,""]
["",{"$nulls":5},"","","","",null,null,"","","",0,""]
["",{"$nulls":5},"","","","",null,null,"","","",0,""]
["",{"$nulls":5},"","","","",null,null,"","","",0,""]
["",{"$nulls":5},"","","","",null,null,"","","",0,""]
["",{"$nulls":5},"","","","",null,null,"","","",0,""]
[{"$f":"IF(ISBLANK(B182),\"\",1+A181)","v":""},{"$nulls":5},"","","","",null,null,"","","",0,""]
["",{"$nulls":5},"","","","",null,null,"","","",0,""]
["",{"$nulls":5},"","","","",null,null,"","","",0,""]
["",{"$nulls":5},"","","","",null,null,"","","",0,""]
["",{"$nulls":5},"","","","",null,null,"","","",0,""]
["",{"$nulls":5},"","","","",null,null,"","","",0,""]
["",{"$nulls":5},"","","","",null,null,"","","",0,""]
["",{"$nulls":5},"","","","",null,null,"","","",0,""]
["",{"$nulls":5},"","","","",null,null,"","","",0,""]
["",{"$nulls":5},"","","","",null,null,"","","",0,""]
["",{"$nulls":5},"","","","",null,null,"","","",0,""]
["",{"$nulls":5},"","","","",null,null,"","","",0,""]
["",{"$nulls":5},"","","","",null,null,"","","",0,""]
["",{"$nulls":5},"","","","",null,null,"","","",0,""]
["",{"$nulls":5},"","","","",null,null,"","","",0,""]
["",{"$nulls":5},"","","","",null,null,"","","",0,""]
["",{"$nulls":5},"","","","",null,null,"","","",0,""]
["",{"$nulls":5},"","","","",null,null,"","","",0,""]
["",{"$nulls":5},"","","","",null,null,"","","",0,""]
["",{"$nulls":5},"","","","",null,null,"","","",0,""]
["",{"$nulls":5},"","","","",null,null,"","","",0,""]
["",{"$nulls":5},"","","","",null,null,"","","",0,""]
["",{"$nulls":5},"","","","",null,null,"","","",0,""]
["",{"$nulls":5},"","","","",null,null,"","","",0,""]
["",{"$nulls":5},{"$f":"IF(ISBLANK(E206),\"\",ROUNDDOWN(E206/10,0))","v":""},{"$f":"IF(ISBLANK(E206),\"\",F206*100/E206)","v":""},{"$f":"IF(ISBLANK(E206),\"\",VLOOKUP(H206,$BT$2:$BW$7,4))","v":""},{"$f":"IF(ISBLANK(D206),\"\",IF(AND($J$11-D206<25),$J$11-D206,\"a. K.\"))","v":""},null,null,{"$f":"IF(ISBLANK(K206),\"\",ROUNDDOWN(K206/10,0))","v":""},{"$f":"IF(ISBLANK(K206),\"\",L206*100/K206)","v":""},{"$f":"IF(ISBLANK(K206),\"\",VLOOKUP(N206,$BT$2:$BW$7,4))","v":""},{"$f":"IF(AND(B206<>\"\",C206<>\"\",OR(E206>0,K206>0)),1,0)","v":0},{"$f":"IF(P206,$P$11,\"\")","v":""}]
["",{"$nulls":5},"","","","",null,null,"","","",0,""]
["",{"$nulls":5},"","","","",null,null,"","","",0,""]
["",{"$nulls":5},"","","","",null,null,"","","",0,""]
["",{"$nulls":5},"","","","",null,null,"","","",0,""]
["",{"$nulls":5},"","","","",null,null,"","","",0,""]
["",{"$nulls":5},"","","","",null,null,"","","",0,""]
["",{"$nulls":5},"","","","",null,null,"","","",0,""]
["",{"$nulls":5},"","","","",null,null,"","","",0,""]
["",{"$nulls":5},"","","","",null,null,"","","",0,""]
["",{"$nulls":5},"","","","",null,null,"","","",0,""]
["",{"$nulls":5},"","","","",null,null,"","","",0,""]
["",{"$nulls":5},"","","","",null,null,"","","",0,""]
["",{"$nulls":5},"","","","",null,null,"","","",0,""]
["",{"$nulls":5},"","","","",null,null,"","","",0,""]
["",{"$nulls":5},"","","","",null,null,"","","",0,""]
["",{"$nulls":5},"","","","",null,null,"","","",0,""]
["",{"$nulls":5},"","","","",null,null,"","","",0,""]
["",{"$nulls":5},"","","","",null,null,"","","",0,""]
["",{"$nulls":5},"","","","",null,null,"","","",0,""]
["",{"$nulls":5},"","","","",null,null,"","","",0,""]
["",{"$nulls":5},"","","","",null,null,"","","",0,""]
["",{"$nulls":5},"","","","",null,null,"","","",0,""]
["",{"$nulls":5},"","","","",null,null,"","","",0,""]
["",{"$nulls":5},"","","","",null,null,"","","",0,""]
["",{"$nulls":5},"","","","",null,null,"","","",0,""]
["",{"$nulls":5},"","","","",null,null,"","","",0,""]
["",{"$nulls":5},"","","","",null,null,"","","",0,""]
["",{"$nulls":5},"","","","",null,null,"","","",0,""]
["",{"$nulls":5},"","","","",null,null,"","","",0,""]
["",{"$nulls":5},"","","","",null,null,"","","",0,""]
["",{"$nulls":5},"","","","",null,null,"","","",0,""]
["",{"$nulls":5},"","","","",null,null,"","","",0,""]
["",{"$nulls":5},"","","","",null,null,"","","",0,""]
["",{"$nulls":5},"","","","",null,null,"","","",0,""]
["",{"$nulls":5},"","","","",null,null,"","","",0,""]
["",{"$nulls":5},"","","","",null,null,"","","",0,""]
["",{"$nulls":5},"","","","",null,null,"","","",0,""]
["",{"$nulls":5},"","","","",null,null,"","","",0,""]
["",{"$nulls":5},"","","","",null,null,"","","",0,""]
[{"$f":"IF(ISBLANK(B246),\"\",1+A245)","v":""},{"$nulls":5},"","","","",null,null,"","","",0,""]
["",{"$nulls":5},"","","","",null,null,"","","",0,""]
["",{"$nulls":5},"","","","",null,null,"","","",0,""]
["",{"$nulls":5},"","","","",null,null,"","","",0,""]
["",{"$nulls":5},"","","","",null,null,"","","",0,""]
["",{"$nulls":5},"","","","",null,null,"","","",0,""]
["",{"$nulls":5},"","","","",null,null,"","","",0,""]
["",{"$nulls":5},"","","","",null,null,"","","",0,""]
["",{"$nulls":5},"","","","",null,null,"","","",0,""]
["",{"$nulls":5},"","","","",null,null,"","","",0,""]
["",{"$nulls":5},"","","","",null,null,"","","",0,""]
["",{"$nulls":5},"","","","",null,null,"","","",0,""]
["",{"$nulls":5},"","","","",null,null,"","","",0,""]
["",{"$nulls":5},"","","","",null,null,"","","",0,""]
["",{"$nulls":5},"","","","",null,null,"","","",0,""]
["",{"$nulls":5},"","","","",null,null,"","","",0,""]
["",{"$nulls":5},"","","","",null,null,"","","",0,""]
["",{"$nulls":5},"","","","",null,null,"","","",0,""]
["",{"$nulls":5},"","","","",null,null,"","","",0,""]
["",{"$nulls":5},"","","","",null,null,"","","",0,""]
["",{"$nulls":5},"","","","",null,null,"","","",0,""]
["",{"$nulls":5},"","","","",null,null,"","","",0,""]
["",{"$nulls":5},"","","","",null,null,"","","",0,""]
["",{"$nulls":5},"","","","",null,null,"","","",0,""]
["",{"$nulls":5},{"$f":"IF(ISBLANK(E270),\"\",ROUNDDOWN(E270/10,0))","v":""},{"$f":"IF(ISBLANK(E270),\"\",F270*100/E270)","v":""},{"$f":"IF(ISBLANK(E270),\"\",VLOOKUP(H270,$BT$2:$BW$7,4))","v":""},{"$f":"IF(ISBLANK(D270),\"\",IF(AND($J$11-D270<25),$J$11-D270,\"a. K.\"))","v":""},null,null,{"$f":"IF(ISBLANK(K270),\"\",ROUNDDOWN(K270/10,0))","v":""},{"$f":"IF(ISBLANK(K270),\"\",L270*100/K270)","v":""},{"$f":"IF(ISBLANK(K270),\"\",VLOOKUP(N270,$BT$2:$BW$7,4))","v":""},{"$f":"IF(AND(B270<>\"\",C270<>\"\",OR(E270>0,K270>0)),1,0)","v":0},{"$f":"IF(P270,$P$11,\"\")","v":""}]
["",{"$nulls":5},"","","","",null,null,"","","",0,""]
["",{"$nulls":5},"","","","",null,null,"","","",0,""]
["",{"$nulls":5},"","","","",null,null,"","","",0,""]
["",{"$nulls":5},"","","","",null,null,"","","",0,""]
["",{"$nulls":5},"","","","",null,null,"","","",0,""]
["",{"$nulls":5},"","","","",null,null,"","","",0,""]
["",{"$nulls":5},"","","","",null,null,"","","",0,""]
["",{"$nulls":5},"","","","",null,null,"","","",0,""]
["",{"$nulls":5},"","","","",null,null,"","","",0,""]
["",{"$nulls":5},"","","","",null,null,"","","",0,""]
["",{"$nulls":5},"","","","",null,null,"","","",0,""]
["",{"$nulls":5},"","","","",null,null,"","","",0,""]
["",{"$nulls":5},"","","","",null,null,"","","",0,""]
["",{"$nulls":5},"","","","",null,null,"","","",0,""]
["",{"$nulls":5},"","","","",null,null,"","","",0,""]
["",{"$nulls":5},"","","","",null,null,"","","",0,""]
["",{"$nulls":5},"","","","",null,null,"","","",0,""]
["",{"$nulls":5},"","","","",null,null,"","","",0,""]
["",{"$nulls":5},"","","","",null,null,"","","",0,""]
["",{"$nulls":5},"","","","",null,null,"","","",0,""]
["",{"$nulls":5},"","","","",null,null,"","","",0,""]
["",{"$nulls":5},"","","","",null,null,"","","",0,""]
["",{"$nulls":5},"","","","",null,null,"","","",0,""]
["",{"$nulls":5},"","","","",null,null,"","","",0,""]
["",{"$nulls":5},"","","","",null,null,"","","",0,""]
["",{"$nulls":5},"","","","",null,null,"","","",0,""]
["",{"$nulls":5},"","","","",null,null,"","","",0,""]
["",{"$nulls":5},"","","","",null,null,"","","",0,""]
["",{"$nulls":5},"","","","",null,null,"","","",0,""]
["",{"$nulls":5},"","","","",null,null,"","","",0,""]
["",{"$nulls":5},"","","","",null,null,"","","",0,""]
["",{"$nulls":5},"","","","",null,null,"","","",0,""]
["",{"$nulls":5},"","","","",null,null,"","","",0,""]
["",{"$nulls":5},"","","","",null,null,"","","",0,""]
["",{"$nulls":5},"","","","",null,null,"","","",0,""]
["",{"$nulls":5},"","","","",null,null,"","","",0,""]
["",{"$nulls":5},"","","","",null,null,"","","",0,""]
["",{"$nulls":5},"","","","",null,null,"","","",0,""]
["",{"$nulls":5},"","","","",null,null,"","","",0,""]
[{"$f":"IF(ISBLANK(B310),\"\",1+A309)","v":""},{"$nulls":5},"","","","",null,null,"","","",0,""]
["",{"$nulls":5},"","","","",null,null,"","","",0,""]
["",{"$nulls":5},"","","","",null,null,"","","",0,""]
["",{"$nulls":5},"","","","",null,null,"","","",0,""]
["",{"$nulls":5},"","","","",null,null,"","","",0,""]
["",{"$nulls":5},"","","","",null,null,"","","",0,""]
["",{"$nulls":5},"","","","",null,null,"","","",0,""]
["",{"$nulls":5},"","","","",null,null,"","","",0,""]
["",{"$nulls":5},"","","","",null,null,"","","",0,""]
["",{"$nulls":5},"","","","",null,null,"","","",0,""]
["",{"$nulls":5},"","","","",null,null,"","","",0,""]
["",{"$nulls":5},"","","","",null,null,"","","",0,""]
["",{"$nulls":5},"","","","",null,null,"","","",0,""]
["",{"$nulls":5},"","","","",null,null,"","","",0,""]
["",{"$nulls":5},"","","","",null,null,"","","",0,""]
["",{"$nulls":5},"","","","",null,null,"","","",0,""]
["",{"$nulls":5},"","","","",null,null,"","","",0,""]
["",{"$nulls":5},"","","","",null,null,"","","",0,""]
["",{"$nulls":5},"","","","",null,null,"","","",0,""]
["",{"$nulls":5},"","","","",null,null,"","","",0,""]
["",{"$nulls":5},"","","","",null,null,"","","",0,""]
["",{"$nulls":5},"","","","",null,null,"","","",0,""]
["",{"$nulls":5},"","","","",null,null,"","","",0,""]
["",{"$nulls":5},"","","","",null,null,"","","",0,""]
["",{"$nulls":5},{"$f":"IF(ISBLANK(E334),\"\",ROUNDDOWN(E334/10,0))","v":""},{"$f":"IF(ISBLANK(E334),\"\",F334*100/E334)","v":""},{"$f":"IF(ISBLANK(E334),\"\",VLOOKUP(H334,$BT$2:$BW$7,4))","v":""},{"$f":"IF(ISBLANK(D334),\"\",IF(AND($J$11-D334<25),$J$11-D334,\"a. K.\"))","v":""},null,null,{"$f":"IF(ISBLANK(K334),\"\",ROUNDDOWN(K334/10,0))","v":""},{"$f":"IF(ISBLANK(K334),\"\",L334*100/K334)","v":""},{"$f":"IF(ISBLANK(K334),\"\",VLOOKUP(N334,$BT$2:$BW$7,4))","v":""},{"$f":"IF(AND(B334<>\"\",C334<>\"\",OR(E334>0,K334>0)),1,0)","v":0},{"$f":"IF(P334,$P$11,\"\")","v":""}]
["",{"$nulls":5},"","","","",null,null,"","","",0,""]
["",{"$nulls":5},"","","","",null,null,"","","",0,""]
["",{"$nulls":5},"","","","",null,null,"","","",0,""]
["",{"$nulls":5},"","","","",null,null,"","","",0,""]
["",{"$nulls":5},"","","","",null,null,"","","",0,""]
["",{"$nulls":5},"","","","",null,null,"","","",0,""]
["",{"$nulls":5},"","","","",null,null,"","","",0,""]
["",{"$nulls":5},"","","","",null,null,"","","",0,""]
["",{"$nulls":5},"","","","",null,null,"","","",0,""]
["",{"$nulls":5},"","","","",null,null,"","","",0,""]
["",{"$nulls":5},"","","","",null,null,"","","",0,""]
["",{"$nulls":5},"","","","",null,null,"","","",0,""]
["",{"$nulls":5},"","","","",null,null,"","","",0,""]
["",{"$nulls":5},"","","","",null,null,"","","",0,""]
["",{"$nulls":5},"","","","",null,null,"","","",0,""]
["",{"$nulls":5},"","","","",null,null,"","","",0,""]
["",{"$nulls":5},"","","","",null,null,"","","",0,""]
["",{"$nulls":5},"","","","",null,null,"","","",0,""]
["",{"$nulls":5},"","","","",null,null,"","","",0,""]
["",{"$nulls":5},"","","","",null,null,"","","",0,""]
["",{"$nulls":5},"","","","",null,null,"","","",0,""]
["",{"$nulls":5},"","","","",null,null,"","","",0,""]
["",{"$nulls":5},"","","","",null,null,"","","",0,""]
["",{"$nulls":5},"","","","",null,null,"","","",0,""]
["",{"$nulls":5},"","","","",null,null,"","","",0,""]
["",{"$nulls":5},"","","","",null,null,"","","",0,""]
["",{"$nulls":5},"","","","",null,null,"","","",0,""]
["",{"$nulls":5},"","","","",null,null,"","","",0,""]
["",{"$nulls":5},"","","","",null,null,"","","",0,""]
["",{"$nulls":5},"","","","",null,null,"","","",0,""]
["",{"$nulls":5},"","","","",null,null,"","","",0,""]
["",{"$nulls":5},"","","","",null,null,"","","",0,""]
["",{"$nulls":5},"","","","",null,null,"","","",0,""]
["",{"$nulls":5},"","","","",null,null,"","","",0,""]
["",{"$nulls":5},"","","","",null,null,"","","",0,""]
["",{"$nulls":5},"","","","",null,null,"","","",0,""]
["",{"$nulls":5},"","","","",null,null,"","","",0,""]
["",{"$nulls":5},"","","","",null,null,"","","",0,""]
["",{"$nulls":5},"","","","",null,null,"","","",0,""]
[{"$f":"IF(ISBLANK(B374),\"\",1+A373)","v":""},{"$nulls":5},"","","","",null,null,"","","",0,""]
["",{"$nulls":5},"","","","",null,null,"","","",0,""]
["",{"$nulls":5},"","","","",null,null,"","","",0,""]
["",{"$nulls":5},"","","","",null,null,"","","",0,""]
["",{"$nulls":5},"","","","",null,null,"","","",0,""]
["",{"$nulls":5},"","","","",null,null,"","","",0,""]
["",{"$nulls":5},"","","","",null,null,"","","",0,""]
["",{"$nulls":5},"","","","",null,null,"","","",0,""]
["",{"$nulls":5},"","","","",null,null,"","","",0,""]
["",{"$nulls":5},"","","","",null,null,"","","",0,""]
["",{"$nulls":5},"","","","",null,null,"","","",0,""]
["",{"$nulls":5},"","","","",null,null,"","","",0,""]
["",{"$nulls":5},"","","","",null,null,"","","",0,""]
["",{"$nulls":5},"","","","",null,null,"","","",0,""]
["",{"$nulls":5},"","","","",null,null,"","","",0,""]
["",{"$nulls":5},"","","","",null,null,"","","",0,""]
["",{"$nulls":5},"","","","",null,null,"","","",0,""]
["",{"$nulls":5},"","","","",null,null,"","","",0,""]
["",{"$nulls":5},"","","","",null,null,"","","",0,""]
["",{"$nulls":5},"","","","",null,null,"","","",0,""]
["",{"$nulls":5},"","","","",null,null,"","","",0,""]
["",{"$nulls":5},"","","","",null,null,"","","",0,""]
["",{"$nulls":5},"","","","",null,null,"","","",0,""]
["",{"$nulls":5},"","","","",null,null,"","","",0,""]
["",{"$nulls":5},{"$f":"IF(ISBLANK(E398),\"\",ROUNDDOWN(E398/10,0))","v":""},{"$f":"IF(ISBLANK(E398),\"\",F398*100/E398)","v":""},{"$f":"IF(ISBLANK(E398),\"\",VLOOKUP(H398,$BT$2:$BW$7,4))","v":""},{"$f":"IF(ISBLANK(D398),\"\",IF(AND($J$11-D398<25),$J$11-D398,\"a. K.\"))","v":""},null,null,{"$f":"IF(ISBLANK(K398),\"\",ROUNDDOWN(K398/10,0))","v":""},{"$f":"IF(ISBLANK(K398),\"\",L398*100/K398)","v":""},{"$f":"IF(ISBLANK(K398),\"\",VLOOKUP(N398,$BT$2:$BW$7,4))","v":""},{"$f":"IF(AND(B398<>\"\",C398<>\"\",OR(E398>0,K398>0)),1,0)","v":0},{"$f":"IF(P398,$P$11,\"\")","v":""}]
["",{"$nulls":5},"","","","",null,null,"","","",0,""]
["",{"$nulls":5},"","","","",null,null,"","","",0,""]
["",{"$nulls":5},"","","","",null,null,"","","",0,""]
["",{"$nulls":5},"","","","",null,null,"","","",0,""]
["",{"$nulls":5},"","","","",null,null,"","","",0,""]
["",{"$nulls":5},"","","","",null,null,"","","",0,""]
["",{"$nulls":5},"","","","",null,null,"","","",0,""]
["",{"$nulls":5},"","","","",null,null,"","","",0,""]
["",{"$nulls":5},"","","","",null,null,"","","",0,""]
["",{"$nulls":5},"","","","",null,null,"","","",0,""]
["",{"$nulls":5},"","","","",null,null,"","","",0,""]
["",{"$nulls":5},"","","","",null,null,"","","",0,""]
["",{"$nulls":5},"","","","",null,null,"","","",0,""]
["",{"$nulls":5},"","","","",null,null,"","","",0,""]
["",{"$nulls":5},"","","","",null,null,"","","",0,""]
["",{"$nulls":5},"","","","",null,null,"","","",0,""]
["",{"$nulls":5},"","","","",null,null,"","","",0,""]
["",{"$nulls":5},"","","","",null,null,"","","",0,""]
["",{"$nulls":5},"","","","",null,null,"","","",0,""]
["",{"$nulls":5},"","","","",null,null,"","","",0,""]
["",{"$nulls":5},"","","","",null,null,"","","",0,""]
["",{"$nulls":5},"","","","",null,null,"","","",0,""]
["",{"$nulls":5},"","","","",null,null,"","","",0,""]
["",{"$nulls":5},"","","","",null,null,"","","",0,""]
["",{"$nulls":5},"","","","",null,null,"","","",0,""]
["",{"$nulls":5},"","","","",null,null,"","","",0,""]
["",{"$nulls":5},"","","","",null,null,"","","",0,""]
["",{"$nulls":5},"","","","",null,null,"","","",0,""]
["",{"$nulls":5},"","","","",null,null,"","","",0,""]
["",{"$nulls":5},"","","","",null,null,"","","",0,""]
["",{"$nulls":5},"","","","",null,null,"","","",0,""]
["",{"$nulls":5},"","","","",null,null,"","","",0,""]
["",{"$nulls":5},"","","","",null,null,"","","",0,""]
["",{"$nulls":5},"","","","",null,null,"","","",0,""]
["",{"$nulls":5},"","","","",null,null,"","","",0,""]
["",{"$nulls":5},"","","","",null,null,"","","",0,""]
["",{"$nulls":5},"","","","",null,null,"","","",0,""]
["",{"$nulls":5},"","","","",null,null,"","","",0,""]
["",{"$nulls":5},"","","","",null,null,"","","",0,""]
[{"$f":"IF(ISBLANK(B438),\"\",1+A437)","v":""},{"$nulls":5},"","","","",null,null,"","","",0,""]
["",{"$nulls":5},"","","","",null,null,"","","",0,""]
["",{"$nulls":5},"","","","",null,null,"","","",0,""]
["",{"$nulls":5},"","","","",null,null,"","","",0,""]
["",{"$nulls":5},"","","","",null,null,"","","",0,""]
["",{"$nulls":5},"","","","",null,null,"","","",0,""]
["",{"$nulls":5},"","","","",null,null,"","","",0,""]
["",{"$nulls":5},"","","","",null,null,"","","",0,""]
["",{"$nulls":5},"","","","",null,null,"","","",0,""]
["",{"$nulls":5},"","","","",null,null,"","","",0,""]
["",{"$nulls":5},"","","","",null,null,"","","",0,""]
["",{"$nulls":5},"","","","",null,null,"","","",0,""]
["",{"$nulls":5},"","","","",null,null,"","","",0,""]
["",{"$nulls":5},"","","","",null,null,"","","",0,""]
["",{"$nulls":5},"","","","",null,null,"","","",0,""]
["",{"$nulls":5},"","","","",null,null,"","","",0,""]
["",{"$nulls":5},"","","","",null,null,"","","",0,""]
["",{"$nulls":5},"","","","",null,null,"","","",0,""]
["",{"$nulls":5},"","","","",null,null,"","","",0,""]
["",{"$nulls":5},"","","","",null,null,"","","",0,""]
["",{"$nulls":5},"","","","",null,null,"","","",0,""]
["",{"$nulls":5},"","","","",null,null,"","","",0,""]
["",{"$nulls":5},"","","","",null,null,"","","",0,""]
["",{"$nulls":5},"","","","",null,null,"","","",0,""]
["",{"$nulls":5},{"$f":"IF(ISBLANK(E462),\"\",ROUNDDOWN(E462/10,0))","v":""},{"$f":"IF(ISBLANK(E462),\"\",F462*100/E462)","v":""},{"$f":"IF(ISBLANK(E462),\"\",VLOOKUP(H462,$BT$2:$BW$7,4))","v":""},{"$f":"IF(ISBLANK(D462),\"\",IF(AND($J$11-D462<25),$J$11-D462,\"a. K.\"))","v":""},null,null,{"$f":"IF(ISBLANK(K462),\"\",ROUNDDOWN(K462/10,0))","v":""},{"$f":"IF(ISBLANK(K462),\"\",L462*100/K462)","v":""},{"$f":"IF(ISBLANK(K462),\"\",VLOOKUP(N462,$BT$2:$BW$7,4))","v":""},{"$f":"IF(AND(B462<>\"\",C462<>\"\",OR(E462>0,K462>0)),1,0)","v":0},{"$f":"IF(P462,$P$11,\"\")","v":""}]
["",{"$nulls":5},"","","","",null,null,"","","",0,""]
["",{"$nulls":5},"","","","",null,null,"","","",0,""]
["",{"$nulls":5},"","","","",null,null,"","","",0,""]
["",{"$nulls":5},"","","","",null,null,"","","",0,""]
["",{"$nulls":5},"","","","",null,null,"","","",0,""]
["",{"$nulls":5},"","","","",null,null,"","","",0,""]
["",{"$nulls":5},"","","","",null,null,"","","",0,""]
["",{"$nulls":5},"","","","",null,null,"","","",0,""]
["",{"$nulls":5},"","","","",null,null,"","","",0,""]
["",{"$nulls":5},"","","","",null,null,"","","",0,""]
["",{"$nulls":5},"","","","",null,null,"","","",0,""]
["",{"$nulls":5},"","","","",null,null,"","","",0,""]
["",{"$nulls":5},"","","","",null,null,"","","",0,""]
["",{"$nulls":5},"","","","",null,null,"","","",0,""]
["",{"$nulls":5},"","","","",null,null,"","","",0,""]
["",{"$nulls":5},"","","","",null,null,"","","",0,""]
["",{"$nulls":5},"","","","",null,null,"","","",0,""]
["",{"$nulls":5},"","","","",null,null,"","","",0,""]
["",{"$nulls":5},"","","","",null,null,"","","",0,""]
["",{"$nulls":5},"","","","",null,null,"","","",0,""]
["",{"$nulls":5},"","","","",null,null,"","","",0,""]
["",{"$nulls":5},"","","","",null,null,"","","",0,""]
["",{"$nulls":5},"","","","",null,null,"","","",0,""]
["",{"$nulls":5},"","","","",null,null,"","","",0,""]
["",{"$nulls":5},"","","","",null,null,"","","",0,""]
["",{"$nulls":5},"","","","",null,null,"","","",0,""]
["",{"$nulls":5},"","","","",null,null,"","","",0,""]
["",{"$nulls":5},"","","","",null,null,"","","",0,""]
["",{"$nulls":5},"","","","",null,null,"","","",0,""]
["",{"$nulls":5},"","","","",null,null,"","","",0,""]
["",{"$nulls":5},"","","","",null,null,"","","",0,""]
["",{"$nulls":5},"","","","",null,null,"","","",0,""]
["",{"$nulls":5},"","","","",null,null,"","","",0,""]
["",{"$nulls":5},"","","","",null,null,"","","",0,""]
["",{"$nulls":5},"","","","",null,null,"","","",0,""]
["",{"$nulls":5},"","","","",null,null,"","","",0,""]
["",{"$nulls":5},"","","","",null,null,"","","",0,""]
["",{"$nulls":5},"","","","",null,null,"","","",0,""]
["",{"$nulls":5},"","","","",null,null,"","","",0,""]
[{"$f":"IF(ISBLANK(B502),\"\",1+A501)","v":""},{"$nulls":5},"","","","",null,null,"","","",0,""]
[{"$f":"IF(ISBLANK(B503),\"\",1+A502)","v":""},{"$nulls":5},"","","","",null,null,"","","",0,""]
[{"$f":"IF(ISBLANK(B504),\"\",1+A503)","v":""},{"$nulls":5},"","","","",null,null,"","","",0,""]

{"sheet":"außerhalb RLP - TN bis 15 Jahre","index":1,"n_rows":504,"n_cols":81,"rows_kept":504,"merged":[[0,2,0,7],[0,12,0,14],[1,2,1,7],[2,2,2,7],[2,10,2,14],[3,2,3,7],[4,2,4,7],[5,3,5,7],[5,10,5,14],[6,3,6,7],[6,17,7,17],[7,2,7,7],[7,9,7,14],[8,2,8,7],[8,11,9,14],[8,16,9,16],[8,17,9,17],[9,0,9,10],[10,0,10,1]]}
["Schule:",{"$nulls":8},"Kenn-Nr.:",null,".",{"$nulls":4},{"$f":"IF(ISBLANK(K1),\"Bitte Kenn-Nr. eintragen!\",\"\")","v":"Bitte Kenn-Nr. eintragen!"},{"$nulls":52},"Anrede",null,"Wertung",{"$nulls":6},"Preisstaffelung"]
["Zusatzangabe:",{"$nulls":9},{"$f":"IF(ISBLANK(K3),\"Bitte Schulart eintragen!\",\"\")","v":"Bitte Schulart eintragen!"},{"$nulls":5},{"$f":"IF(ISBLANK(R3),\"Bitte Datum eintragen!\",\"\")","v":"Bitte Datum eintragen!"},{"$nulls":52},"Frau",null,{"v":0,"d":"0.000"},"-",{"v":0.08,"d":"0.080"},1,{"$nulls":3},"ab",0,{"v":3,"d":"3.00 €"}]
["Straße/Hausnummer:",{"$nulls":8},"Schulart:",{"$nulls":6},"Datum:",{"$nulls":52},"Herr",null,{"v":0.0801,"d":"0.080"},"-",{"v":0.19,"d":"0.190"},2,{"$nulls":3},"ab",50,{"v":2.5,"d":"2.50 €"}]
["PLZ:",{"$nulls":8},"Anrede:","Vor-/Zuname der Lehrkraft",{"$nulls":3},{"$f":"IF(ISBLANK(R6),\"Bitte Tel.-Nr. für kurzfristige Rückfragen angeben!\",\"\")","v":"Bitte Tel.-Nr. für kurzfristige Rückfragen angeben!"},{"$nulls":56},{"v":0.1901,"d":"0.190"},"-",{"v":0.33,"d":"0.330"},3,{"$nulls":3},"ab",100,{"v":2,"d":"2.00 €"}]
["Ort:"]
["Telefon: (dienst.)",{"$nulls":15},"Tel.:(privat)",{"$nulls":54},{"v":0.3301,"d":"0.330"},"-",{"v":0.5,"d":"0.500"},4]
["Fax:",{"$nulls":8},"E-Mail:",{"$nulls":59},"Wert",null,{"v":0.5001,"d":"0.500"},"-",null,"TN"]
["Bundesland/Land:",{"$nulls":15},"Anmerkungen",{"$nulls":54},"TN","=","Teilnahme"]
["Sonstiges Land:",{"$nulls":10},"Gesamt",{"$nulls":3},{"$f":"SUM(P13:P504)","v":0},{"$f":"P9","v":0},"Wettschreib-Teilnehmer"]
["Teilnehmer außerhalb von RLP bis 15 Jahre!"]
[{"$f":"H11+N11","v":0},null,"Punkte für die Schule",{"$f":"TODAY()","v":"2019-01-09"},"Landessprache",null,null,{"$f":"COUNT(F13:F504)","v":0},null,2019,"Fremdsprache",null,null,{"$f":"COUNT(L13:L504)","v":0},null,{"$f":"VLOOKUP(P9,CB2:CC4,2)","v":{"v":3,"d":"3.00 €"}},{"$f":"IF((P11*Q9)<10,10,P11*Q9)","v":{"v":10,"d":"10.00 €"}},"zu zahlender Gesamtbetrag"]
["Lfd.-Nr.","Nachname\nausgeschrieben","Vorname ausgeschrieben","Geburtsjahr\n4-stellig angeben","Gesamt-anschläge","Fehler","Minuten-An-schläge","Quotient","Note","ohne Alters-angabe\na. K.","Gesamt-anschläge","Fehler","Minuten-An-schläge","Quotient","Note","TN","Teilnehmer-Gebühr","sonstige schulinterne Angaben"]
[1,{"$nulls":5},{"$f":"IF(ISBLANK(E13),\"\",ROUNDDOWN(E13/10,0))","v":""},{"$f":"IF(ISBLANK(E13),\"\",F13*100/E13)","v":""},{"$f":"IF(ISBLANK(E13),\"\",VLOOKUP(H13,$BT$2:$BW$7,4))","v":""},{"$f":"IF(ISBLANK(D13),\"\",IF(($J$11-D13)>15,\"a. K.\",($J$11-D13)))","v":""},null,null,{"$f":"IF(ISBLANK(K13),\"\",ROUNDDOWN(K13/10,0))","v":""},{"$f":"IF(ISBLANK(K13),\"\",L13*100/K13)","v":""},{"$f":"IF(ISBLANK(K13),\"\",VLOOKUP(N13,$BT$2:$BW$7,4))","v":""},{"$f":"IF(AND(B13<>\"\",C13<>\"\",OR(E13>0,K13>0)),1,0)","v":0},{"$f":"IF(P13,$P$11,\"\")","v":""},{"$nulls":52},"Werte",null,"Schulart:",null,null,"Land/Bundesland:"]
[{"$f":"IF(ISBLANK(B14),\"\",1+A13)","v":""},{"$nulls":5},{"$f":"IF(ISBLANK(E14),\"\",ROUNDDOWN(E14/10,0))","v":""},{"$f":"IF(ISBLANK(E14),\"\",F14*100/E14)","v":""},{"$f":"IF(ISBLANK(E14),\"\",VLOOKUP(H14,$BT$2:$BW$7,4))","v":""},{"$f":"IF(ISBLANK(D14),\"\",IF(($J$11-D14)>15,\"a. K.\",($J$11-D14)))","v":""},null,null,{"$f":"IF(ISBLANK(K14),\"\",ROUNDDOWN(K14/10,0))","v":""},{"$f":"IF(ISBLANK(K14),\"\",L14*100/K14)","v":""},{"$f":"IF(ISBLANK(K14),\"\",VLOOKUP(N14,$BT$2:$BW$7,4))","v":""},{"$f":"IF(AND(B14<>\"\",C14<>\"\",OR(E14>0,K14>0)),1,0)","v":0},{"$f":"IF(P14,$P$11,\"\")","v":""},{"$nulls":52},10,null,"BBS/BFS",null,null,"Belgien",null,null,"B         - Belgien"]
[{"$f":"IF(ISBLANK(B15),\"\",1+A14)","v":""},{"$nulls":5},"","","",{"$f":"IF(ISBLANK(D15),\"\",IF(($J$11-D15)>15,\"a. K.\",($J$11-D15)))","v":""},null,null,"","","",0,"",{"$nulls":52},11,null,"Gymnasium",null,null,"Berlin",null,null,"BLN     - Berlin"]
[{"$f":"IF(ISBLANK(B16),\"\",1+A15)","v":""},{"$nulls":5},"","","","",null,null,"","","",0,"",{"$nulls":52},20,null,"Realschule+/IGS",null,null,"Brandenburg",null,null,"BRA     - Brandenburg"]
[{"$f":"IF(ISBLANK(B17),\"\",1+A16)","v":""},{"$nulls":5},"","","","",null,null,"","","",0,"",{"$nulls":52},30,null,"Grundschule",null,null,"Bremen",null,null,"BR       - Bremen"]
[{"$f":"IF(ISBLANK(B18),\"\",1+A17)","v":""},{"$nulls":5},"","","","",null,null,"","","",0,"",{"$nulls":52},40,null,"Förderschule",null,null,"Baden-Württemberg",null,null,"BW      - Baden-Württemberg"]
[{"$f":"IF(ISBLANK(B19),\"\",1+A18)","v":""},{"$nulls":5},"","","","",null,null,"","","",0,"",{"$nulls":52},50,null,"Verein",null,null,"Bayern",null,null,"BY       - Bayern"]
["",{"$nulls":5},"","","","",null,null,"","","",0,"",{"$nulls":54},"VHS",null,null,"Schweiz",null,null,"CH       - Schweiz"]
["",{"$nulls":5},"","","","",null,null,"","","",0,"",{"$nulls":54},"freier Bildungsträger",null,null,"Hessen",null,null,"HE       - Hessen"]
["",{"$nulls":5},"","","","",null,null,"","","",0,"",{"$nulls":54},"Privatschule",null,null,"Hamburg",null,null,"HH       - Hamburg"]
["",{"$nulls":5},"","","","",null,null,"","","",0,"",{"$nulls":54},"Hauptschule",null,null,"Mecklenburg-Vorpommern",null,null,"MEVO  - Mecklenburg-Vorpommern"]
["",{"$nulls":5},"","","","",null,null,"","","",0,"",{"$nulls":54},"Mittelschule",null,null,"Niedersachsen",null,null,"NI         - Niedersachsen"]
["",{"$nulls":5},"","","","",null,null,"","","",0,"",{"$nulls":54},"sonstige Schulart",null,null,"Niederlande",null,null,"NL        - Niederlande"]
["",{"$nulls":5},"","","","",null,null,"","","",0,"",{"$nulls":57},"Nordrhein-Westfalen",null,null,"NRW    - Nordrhein-Westfalen"]
["",{"$nulls":5},"","","","",null,null,"","","",0,"",{"$nulls":57},"Rheinland-Pfalz",null,null,"RLP      - Rheinland-Pfalz"]
["",{"$nulls":5},"","","","",null,null,"","","",0,"",{"$nulls":57},"Saarland",null,null,"SA        - Sachsen"]
["",{"$nulls":5},"","","","",null,null,"","","",0,"",{"$nulls":57},"Sachsen",null,null,"SAAN   - Sachsen-Anhalt"]
["",{"$nulls":5},"","","","",null,null,"","","",0,"",{"$nulls":57},"Sachsen-Anhalt",null,null,"SH       - Schleswig-Holstein"]
["",{"$nulls":5},"","","","",null,null,"","","",0,"",{"$nulls":57},"Schleswig-Holstein",null,null,"SL        - Saarland"]
["",{"$nulls":5},"","","","",null,null,"","","",0,"",{"$nulls":57},"Thüringen",null,null,"TH       - Thüringen"]
["",{"$nulls":5},"","","","",null,null,"","","",0,"",{"$nulls":57},"Sonstiges",null,null,"So        - Sonstiges"]
["",{"$nulls":5},"","","","",null,null,"","","",0,"",{"$nulls":54},"Anrede:"]
["",{"$nulls":5},"","","","",null,null,"","","",0,"",{"$nulls":54},"Frau"]
["",{"$nulls":5},"","","","",null,null,"","","",0,"",{"$nulls":54},"Herr"]
["",{"$nulls":5},"","","","",null,null,"","","",0,""]
["",{"$nulls":5},"","","","",null,null,"","","",0,"",{"$nulls":54},"Schul-Kenn-Nr.:",null,"Schule in/außerhalb"]
["",{"$nulls":5},"","","","",null,null,"","","",0,"",{"$nulls":54},10,null,"Schulen in Rheinland-Pfalz"]
["",{"$nulls":5},"","","","",null,null,"","","",0,"",{"$nulls":54},20,null,"Schulen im Ausland"]
["",{"$nulls":5},"","","","",null,null,"","","",0,"",{"$nulls":54},30,null,"Schulen außerhalb von RLP"]
["",{"$nulls":5},"","","","",null,null,"","","",0,"",{"$nulls":54},40]
["",{"$nulls":5},"","","","",null,null,"","","",0,"",{"$nulls":54},50]
["",{"$nulls":5},"","","","",null,null,"","","",0,"",{"$nulls":54},60]
["",{"$nulls":5},"","","","",null,null,"","","",0,"",{"$nulls":54},70]
["",{"$nulls":5},"","","","",null,null,"","","",0,"",{"$nulls":54},80]
["",{"$nulls":5},"","","","",null,null,"","","",0,"",{"$nulls":54},90]
["",{"$nulls":5},"","","","",null,null,"","","",0,""]
["",{"$nulls":5},"","","","",null,null,"","","",0,"",{"$nulls":54},11,null,"BBS/BFS"]
["",{"$nulls":5},"","","","",null,null,"","","",0,"",{"$nulls":54},12,null,"Gymnasium"]
["",{"$nulls":5},"","","","",null,null,"","","",0,"",{"$nulls":54},13,null,"Realschule +/IGS"]
["",{"$nulls":5},"","","","",null,null,"","","",0,"",{"$nulls":54},14,null,"Grundschule - Primärstufe"]
["",{"$nulls":5},"","","","",null,null,"","","",0,"",{"$nulls":54},15,null,"Förderschule - motorischer Hintergrund"]
["",{"$nulls":5},"","","","",null,null,"","","",0,"",{"$nulls":54},16,null,"freie Bildungsträger"]
["",{"$nulls":5},"","","","",null,null,"","","",0,"",{"$nulls":54},17,null,"VHS - Erwachsenenbildung"]
["",{"$nulls":5},"","","","",null,null,"","","",0,"",{"$nulls":54},18,null,"Vereine"]
["",{"$nulls":5},"","","","",null,null,"","","",0,"",{"$nulls":54},19,null,"sonstige"]
["",{"$nulls":5},"","","","",null,null,"","","",0,""]
["",{"$nulls":5},"","","","",null,null,"","","",0,"",{"$nulls":54},21,null,"BBS/BFS"]
["",{"$nulls":5},"","","","",null,null,"","","",0,"",{"$nulls":54},22,null,"Gymnasium"]
["",{"$nulls":5},"","","","",null,null,"","","",0,"",{"$nulls":54},23,null,"Realschule +/IGS"]
["",{"$nulls":5},"","","","",null,null,"","","",0,"",{"$nulls":54},24,null,"Grundschule - Primärstufe"]
["",{"$nulls":5},"","","","",null,null,"","","",0,"",{"$nulls":54},25,null,"Förderschule - motorischer Hintergrund"]
["",{"$nulls":5},"","","","",null,null,"","","",0,"",{"$nulls":54},26,null,"freie Bildungsträger"]
["",{"$nulls":5},"","","","",null,null,"","","",0,"",{"$nulls":54},27,null,"VHS - Erwachsenenbildung"]
["",{"$nulls":5},"","","","",null,null,"","","",0,"",{"$nulls":54},28,null,"Vereine"]
["",{"$nulls":5},"","","","",null,null,"","","",0,"",{"$nulls":54},29,null,"sonstige"]
["",{"$nulls":5},"","","","",null,null,"","","",0,""]
["",{"$nulls":5},"","","","",null,null,"","","",0,"",{"$nulls":54},31,null,"BBS/BFS"]
["",{"$nulls":5},"","","","",null,null,"","","",0,"",{"$nulls":54},32,null,"Gymnasium"]
["",{"$nulls":5},"","","","",null,null,"","","",0,"",{"$nulls":54},33,null,"Realschule +/IGS"]
["",{"$nulls":5},"","","","",null,null,"","","",0,"",{"$nulls":54},34,null,"Grundschule - Primärstufe"]
["",{"$nulls":5},"","","","",null,null,"","","",0,"",{"$nulls":54},35,null,"Förderschule - motorischer Hintergrund"]
["",{"$nulls":5},"","","","",null,null,"","","",0,"",{"$nulls":54},36,null,"freie Bildungsträger"]
["",{"$nulls":5},"","","","",null,null,"","","",0,"",{"$nulls":54},37,null,"VHS - Erwachsenenbildung"]
["",{"$nulls":5},"","","","",null,null,"","","",0,"",{"$nulls":54},38,null,"Vereine"]
["",{"$nulls":5},"","","","",null,null,"","","",0,"",{"$nulls":54},39,null,"sonstige"]
["",{"$nulls":5},{"$f":"IF(ISBLANK(E78),\"\",ROUNDDOWN(E78/10,0))","v":""},{"$f":"IF(ISBLANK(E78),\"\",F78*100/E78)","v":""},{"$f":"IF(ISBLANK(E78),\"\",VLOOKUP(H78,$BT$2:$BW$7,4))","v":""},"",null,null,{"$f":"IF(ISBLANK(K78),\"\",ROUNDDOWN(K78/10,0))","v":""},{"$f":"IF(ISBLANK(K78),\"\",L78*100/K78)","v":""},{"$f":"IF(ISBLANK(K78),\"\",VLOOKUP(N78,$BT$2:$BW$7,4))","v":""},{"$f":"IF(AND(B78<>\"\",C78<>\"\",OR(E78>0,K78>0)),1,0)","v":0},{"$f":"IF(P78,$P$11,\"\")","v":""}]
["",{"$nulls":5},"","","",{"$f":"IF(ISBLANK(D79),\"\",IF(($J$11-D79)>15,\"a. K.\",($J$11-D79)))","v":""},null,null,"","","",0,""]
[{"$f":"IF(ISBLANK(B80),\"\",1+A79)","v":""},{"$nulls":5},"","","","",null,null,"","","",0,""]
["",{"$nulls":5},"","","","",null,null,"","","",0,""]
["",{"$nulls":5},"","","","",null,null,"","","",0,""]
["",{"$nulls":5},"","","","",null,null,"","","",0,""]
["",{"$nulls":5},"","","","",null,null,"","","",0,""]
["",{"$nulls":5},"","","","",null,null,"","","",0,""]
["",{"$nulls":5},"","","","",null,null,"","","",0,""]
["",{"$nulls":5},"","","","",null,null,"","","",0,""]
["",{"$nulls":5},"","","","",null,null,"","","",0,""]
["",{"$nulls":5},"","","","",null,null,"","","",0,""]
["",{"$nulls":5},"","","","",null,null,"","","",0,""]
["",{"$nulls":5},"","","","",null,null,"","","",0,""]
["",{"$nulls":5},"","","","",null,null,"","","",0,""]
["",{"$nulls":5},"","","","",null,null,"","","",0,""]
["",{"$nulls":5},"","","","",null,null,"","","",0,""]
["",{"$nulls":5},"","","","",null,null,"","","",0,""]
["",{"$nulls":5},"","","","",null,null,"","","",0,""]
["",{"$nulls":5},"","","","",null,null,"","","",0,""]
["",{"$nulls":5},"","","","",null,null,"","","",0,""]
["",{"$nulls":5},"","","","",null,null,"","","",0,""]
["",{"$nulls":5},"","","","",null,null,"","","",0,""]
["",{"$nulls":5},"","","","",null,null,"","","",0,""]
["",{"$nulls":5},"","","","",null,null,"","","",0,""]
["",{"$nulls":5},"","","","",null,null,"","","",0,""]
["",{"$nulls":5},"","","","",null,null,"","","",0,""]
["",{"$nulls":5},"","","","",null,null,"","","",0,""]
["",{"$nulls":5},"","","","",null,null,"","","",0,""]
["",{"$nulls":5},"","","","",null,null,"","","",0,""]
["",{"$nulls":5},"","","","",null,null,"","","",0,""]
["",{"$nulls":5},"","","","",null,null,"","","",0,""]
["",{"$nulls":5},"","","","",null,null,"","","",0,""]
["",{"$nulls":5},"","","","",null,null,"","","",0,""]
["",{"$nulls":5},"","","","",null,null,"","","",0,""]
["",{"$nulls":5},"","","","",null,null,"","","",0,""]
["",{"$nulls":5},"","","","",null,null,"","","",0,""]
["",{"$nulls":5},"","","","",null,null,"","","",0,""]
["",{"$nulls":5},"","","","",null,null,"","","",0,""]
["",{"$nulls":5},"","","","",null,null,"","","",0,""]
["",{"$nulls":5},"","","","",null,null,"","","",0,""]
["",{"$nulls":5},"","","","",null,null,"","","",0,""]
["",{"$nulls":5},"","","","",null,null,"","","",0,""]
["",{"$nulls":5},"","","","",null,null,"","","",0,""]
["",{"$nulls":5},"","","","",null,null,"","","",0,""]
["",{"$nulls":5},"","","","",null,null,"","","",0,""]
["",{"$nulls":5},"","","","",null,null,"","","",0,""]
["",{"$nulls":5},"","","","",null,null,"","","",0,""]
["",{"$nulls":5},"","","","",null,null,"","","",0,""]
["",{"$nulls":5},"","","","",null,null,"","","",0,""]
["",{"$nulls":5},"","","","",null,null,"","","",0,""]
["",{"$nulls":5},"","","","",null,null,"","","",0,""]
["",{"$nulls":5},"","","","",null,null,"","","",0,""]
["",{"$nulls":5},"","","","",null,null,"","","",0,""]
["",{"$nulls":5},"","","","",null,null,"","","",0,""]
["",{"$nulls":5},"","","","",null,null,"","","",0,""]
["",{"$nulls":5},"","","","",null,null,"","","",0,""]
["",{"$nulls":5},"","","","",null,null,"","","",0,""]
["",{"$nulls":5},"","","","",null,null,"","","",0,""]
["",{"$nulls":5},"","","","",null,null,"","","",0,""]
["",{"$nulls":5},"","","","",null,null,"","","",0,""]
["",{"$nulls":5},"","","","",null,null,"","","",0,""]
["",{"$nulls":5},"","","","",null,null,"","","",0,""]
["",{"$nulls":5},"","","","",null,null,"","","",0,""]
["",{"$nulls":5},{"$f":"IF(ISBLANK(E142),\"\",ROUNDDOWN(E142/10,0))","v":""},{"$f":"IF(ISBLANK(E142),\"\",F142*100/E142)","v":""},{"$f":"IF(ISBLANK(E142),\"\",VLOOKUP(H142,$BT$2:$BW$7,4))","v":""},"",null,null,{"$f":"IF(ISBLANK(K142),\"\",ROUNDDOWN(K142/10,0))","v":""},{"$f":"IF(ISBLANK(K142),\"\",L142*100/K142)","v":""},{"$f":"IF(ISBLANK(K142),\"\",VLOOKUP(N142,$BT$2:$BW$7,4))","v":""},{"$f":"IF(AND(B142<>\"\",C142<>\"\",OR(E142>0,K142>0)),1,0)","v":0},{"$f":"IF(P142,$P$11,\"\")","v":""}]
["",{"$nulls":5},"","","",{"$f":"IF(ISBLANK(D143),\"\",IF(($J$11-D143)>15,\"a. K.\",($J$11-D143)))","v":""},null,null,"","","",0,""]
[{"$f":"IF(ISBLANK(B144),\"\",1+A143)","v":""},{"$nulls":5},"","","","",null,null,"","","",0,""]
["",{"$nulls":5},"","","","",null,null,"","","",0,""]
["",{"$nulls":5},"","","","",null,null,"","","",0,""]
["",{"$nulls":5},"","","","",null,null,"","","",0,""]
["",{"$nulls":5},"","","","",null,null,"","","",0,""]
["",{"$nulls":5},"","","","",null,null,"","","",0,""]
["",{"$nulls":5},"","","","",null,null,"","","",0,""]
["",{"$nulls":5},"","","","",null,null,"","","",0,""]
["",{"$nulls":5},"","","","",null,null,"","","",0,""]
["",{"$nulls":5},"","","","",null,null,"","","",0,""]
["",{"$nulls":5},"","","","",null,null,"","","",0,""]
["",{"$nulls":5},"","","","",null,null,"","","",0,""]
["",{"$nulls":5},"","","","",null,null,"","","",0,""]
["",{"$nulls":5},"","","","",null,null,"","","",0,""]
["",{"$nulls":5},"","","","",null,null,"","","",0,""]
["",{"$nulls":5},"","","","",null,null,"","","",0,""]
["",{"$nulls":5},"","","","",null,null,"","","",0,""]
["",{"$nulls":5},"","","","",null,null,"","","",0,""]
["",{"$nulls":5},"","","","",null,null,"","","",0,""]
["",{"$nulls":5},"","","","",null,null,"","","",0,""]
["",{"$nulls":5},"","","","",null,null,"","","",0,""]
["",{"$nulls":5},"","","","",null,null,"","","",0,""]
["",{"$nulls":5},"","","","",null,null,"","","",0,""]
["",{"$nulls":5},"","","","",null,null,"","","",0,""]
["",{"$nulls":5},"","","","",null,null,"","","",0,""]
["",{"$nulls":5},"","","","",null,null,"","","",0,""]
["",{"$nulls":5},"","","","",null,null,"","","",0,""]
["",{"$nulls":5},"","","","",null,null,"","","",0,""]
["",{"$nulls":5},"","","","",null,null,"","","",0,""]
["",{"$nulls":5},"","","","",null,null,"","","",0,""]
["",{"$nulls":5},"","","","",null,null,"","","",0,""]
["",{"$nulls":5},"","","","",null,null,"","","",0,""]
["",{"$nulls":5},"","","","",null,null,"","","",0,""]
["",{"$nulls":5},"","","","",null,null,"","","",0,""]
["",{"$nulls":5},"","","","",null,null,"","","",0,""]
["",{"$nulls":5},"","","","",null,null,"","","",0,""]
["",{"$nulls":5},"","","","",null,null,"","","",0,""]
["",{"$nulls":5},"","","","",null,null,"","","",0,""]
["",{"$nulls":5},"","","","",null,null,"","","",0,""]
["",{"$nulls":5},"","","","",null,null,"","","",0,""]
["",{"$nulls":5},"","","","",null,null,"","","",0,""]
["",{"$nulls":5},"","","","",null,null,"","","",0,""]
["",{"$nulls":5},"","","","",null,null,"","","",0,""]
["",{"$nulls":5},"","","","",null,null,"","","",0,""]
["",{"$nulls":5},"","","","",null,null,"","","",0,""]
["",{"$nulls":5},"","","","",null,null,"","","",0,""]
["",{"$nulls":5},"","","","",null,null,"","","",0,""]
["",{"$nulls":5},"","","","",null,null,"","","",0,""]
["",{"$nulls":5},"","","","",null,null,"","","",0,""]
["",{"$nulls":5},"","","","",null,null,"","","",0,""]
["",{"$nulls":5},"","","","",null,null,"","","",0,""]
["",{"$nulls":5},"","","","",null,null,"","","",0,""]
["",{"$nulls":5},"","","","",null,null,"","","",0,""]
["",{"$nulls":5},"","","","",null,null,"","","",0,""]
["",{"$nulls":5},"","","","",null,null,"","","",0,""]
["",{"$nulls":5},"","","","",null,null,"","","",0,""]
["",{"$nulls":5},"","","","",null,null,"","","",0,""]
["",{"$nulls":5},"","","","",null,null,"","","",0,""]
["",{"$nulls":5},"","","","",null,null,"","","",0,""]
["",{"$nulls":5},"","","","",null,null,"","","",0,""]
["",{"$nulls":5},"","","","",null,null,"","","",0,""]
["",{"$nulls":5},"","","","",null,null,"","","",0,""]
["",{"$nulls":5},{"$f":"IF(ISBLANK(E206),\"\",ROUNDDOWN(E206/10,0))","v":""},{"$f":"IF(ISBLANK(E206),\"\",F206*100/E206)","v":""},{"$f":"IF(ISBLANK(E206),\"\",VLOOKUP(H206,$BT$2:$BW$7,4))","v":""},"",null,null,{"$f":"IF(ISBLANK(K206),\"\",ROUNDDOWN(K206/10,0))","v":""},{"$f":"IF(ISBLANK(K206),\"\",L206*100/K206)","v":""},{"$f":"IF(ISBLANK(K206),\"\",VLOOKUP(N206,$BT$2:$BW$7,4))","v":""},{"$f":"IF(AND(B206<>\"\",C206<>\"\",OR(E206>0,K206>0)),1,0)","v":0},{"$f":"IF(P206,$P$11,\"\")","v":""}]
["",{"$nulls":5},"","","",{"$f":"IF(ISBLANK(D207),\"\",IF(($J$11-D207)>15,\"a. K.\",($J$11-D207)))","v":""},null,null,"","","",0,""]
[{"$f":"IF(ISBLANK(B208),\"\",1+A207)","v":""},{"$nulls":5},"","","","",null,null,"","","",0,""]
["",{"$nulls":5},"","","","",null,null,"","","",0,""]
["",{"$nulls":5},"","","","",null,null,"","","",0,""]
["",{"$nulls":5},"","","","",null,null,"","","",0,""]
["",{"$nulls":5},"","","","",null,null,"","","",0,""]
["",{"$nulls":5},"","","","",null,null,"","","",0,""]
["",{"$nulls":5},"","","","",null,null,"","","",0,""]
["",{"$nulls":5},"","","","",null,null,"","","",0,""]
["",{"$nulls":5},"","","","",null,null,"","","",0,""]
["",{"$nulls":5},"","","","",null,null,"","","",0,""]
["",{"$nulls":5},"","","","",null,null,"","","",0,""]
["",{"$nulls":5},"","","","",null,null,"","","",0,""]
["",{"$nulls":5},"","","","",null,null,"","","",0,""]
["",{"$nulls":5},"","","","",null,null,"","","",0,""]
["",{"$nulls":5},"","","","",null,null,"","","",0,""]
["",{"$nulls":5},"","","","",null,null,"","","",0,""]
["",{"$nulls":5},"","","","",null,null,"","","",0,""]
["",{"$nulls":5},"","","","",null,null,"","","",0,""]
["",{"$nulls":5},"","","","",null,null,"","","",0,""]
["",{"$nulls":5},"","","","",null,null,"","","",0,""]
["",{"$nulls":5},"","","","",null,null,"","","",0,""]
["",{"$nulls":5},"","","","",null,null,"","","",0,""]
["",{"$nulls":5},"","","","",null,null,"","","",0,""]
["",{"$nulls":5},"","","","",null,null,"","","",0,""]
["",{"$nulls":5},"","","","",null,null,"","","",0,""]
["",{"$nulls":5},"","","","",null,null,"","","",0,""]
["",{"$nulls":5},"","","","",null,null,"","","",0,""]
["",{"$nulls":5},"","","","",null,null,"","","",0,""]
["",{"$nulls":5},"","","","",null,null,"","","",0,""]
["",{"$nulls":5},"","","","",null,null,"","","",0,""]
["",{"$nulls":5},"","","","",null,null,"","","",0,""]
["",{"$nulls":5},"","","","",null,null,"","","",0,""]
["",{"$nulls":5},"","","","",null,null,"","","",0,""]
["",{"$nulls":5},"","","","",null,null,"","","",0,""]
["",{"$nulls":5},"","","","",null,null,"","","",0,""]
["",{"$nulls":5},"","","","",null,null,"","","",0,""]
["",{"$nulls":5},"","","","",null,null,"","","",0,""]
["",{"$nulls":5},"","","","",null,null,"","","",0,""]
["",{"$nulls":5},"","","","",null,null,"","","",0,""]
["",{"$nulls":5},"","","","",null,null,"","","",0,""]
["",{"$nulls":5},"","","","",null,null,"","","",0,""]
["",{"$nulls":5},"","","","",null,null,"","","",0,""]
["",{"$nulls":5},"","","","",null,null,"","","",0,""]
["",{"$nulls":5},"","","","",null,null,"","","",0,""]
["",{"$nulls":5},"","","","",null,null,"","","",0,""]
["",{"$nulls":5},"","","","",null,null,"","","",0,""]
["",{"$nulls":5},"","","","",null,null,"","","",0,""]
["",{"$nulls":5},"","","","",null,null,"","","",0,""]
["",{"$nulls":5},"","","","",null,null,"","","",0,""]
["",{"$nulls":5},"","","","",null,null,"","","",0,""]
["",{"$nulls":5},"","","","",null,null,"","","",0,""]
["",{"$nulls":5},"","","","",null,null,"","","",0,""]
["",{"$nulls":5},"","","","",null,null,"","","",0,""]
["",{"$nulls":5},"","","","",null,null,"","","",0,""]
["",{"$nulls":5},"","","","",null,null,"","","",0,""]
["",{"$nulls":5},"","","","",null,null,"","","",0,""]
["",{"$nulls":5},"","","","",null,null,"","","",0,""]
["",{"$nulls":5},"","","","",null,null,"","","",0,""]
["",{"$nulls":5},"","","","",null,null,"","","",0,""]
["",{"$nulls":5},"","","","",null,null,"","","",0,""]
["",{"$nulls":5},"","","","",null,null,"","","",0,""]
["",{"$nulls":5},"","","","",null,null,"","","",0,""]
["",{"$nulls":5},{"$f":"IF(ISBLANK(E270),\"\",ROUNDDOWN(E270/10,0))","v":""},{"$f":"IF(ISBLANK(E270),\"\",F270*100/E270)","v":""},{"$f":"IF(ISBLANK(E270),\"\",VLOOKUP(H270,$BT$2:$BW$7,4))","v":""},"",null,null,{"$f":"IF(ISBLANK(K270),\"\",ROUNDDOWN(K270/10,0))","v":""},{"$f":"IF(ISBLANK(K270),\"\",L270*100/K270)","v":""},{"$f":"IF(ISBLANK(K270),\"\",VLOOKUP(N270,$BT$2:$BW$7,4))","v":""},{"$f":"IF(AND(B270<>\"\",C270<>\"\",OR(E270>0,K270>0)),1,0)","v":0},{"$f":"IF(P270,$P$11,\"\")","v":""}]
["",{"$nulls":5},"","","",{"$f":"IF(ISBLANK(D271),\"\",IF(($J$11-D271)>15,\"a. K.\",($J$11-D271)))","v":""},null,null,"","","",0,""]
[{"$f":"IF(ISBLANK(B272),\"\",1+A271)","v":""},{"$nulls":5},"","","","",null,null,"","","",0,""]
["",{"$nulls":5},"","","","",null,null,"","","",0,""]
["",{"$nulls":5},"","","","",null,null,"","","",0,""]
["",{"$nulls":5},"","","","",null,null,"","","",0,""]
["",{"$nulls":5},"","","","",null,null,"","","",0,""]
["",{"$nulls":5},"","","","",null,null,"","","",0,""]
["",{"$nulls":5},"","","","",null,null,"","","",0,""]
["",{"$nulls":5},"","","","",null,null,"","","",0,""]
["",{"$nulls":5},"","","","",null,null,"","","",0,""]
["",{"$nulls":5},"","","","",null,null,"","","",0,""]
["",{"$nulls":5},"","","","",null,null,"","","",0,""]
["",{"$nulls":5},"","","","",null,null,"","","",0,""]
["",{"$nulls":5},"","","","",null,null,"","","",0,""]
["",{"$nulls":5},"","","","",null,null,"","","",0,""]
["",{"$nulls":5},"","","","",null,null,"","","",0,""]
["",{"$nulls":5},"","","","",null,null,"","","",0,""]
["",{"$nulls":5},"","","","",null,null,"","","",0,""]
["",{"$nulls":5},"","","","",null,null,"","","",0,""]
["",{"$nulls":5},"","","","",null,null,"","","",0,""]
["",{"$nulls":5},"","","","",null,null,"","","",0,""]
["",{"$nulls":5},"","","","",null,null,"","","",0,""]
["",{"$nulls":5},"","","","",null,null,"","","",0,""]
["",{"$nulls":5},"","","","",null,null,"","","",0,""]
["",{"$nulls":5},"","","","",null,null,"","","",0,""]
["",{"$nulls":5},"","","","",null,null,"","","",0,""]
["",{"$nulls":5},"","","","",null,null,"","","",0,""]
["",{"$nulls":5},"","","","",null,null,"","","",0,""]
["",{"$nulls":5},"","","","",null,null,"","","",0,""]
["",{"$nulls":5},"","","","",null,null,"","","",0,""]
["",{"$nulls":5},"","","","",null,null,"","","",0,""]
["",{"$nulls":5},"","","","",null,null,"","","",0,""]
["",{"$nulls":5},"","","","",null,null,"","","",0,""]
["",{"$nulls":5},"","","","",null,null,"","","",0,""]
["",{"$nulls":5},"","","","",null,null,"","","",0,""]
["",{"$nulls":5},"","","","",null,null,"","","",0,""]
["",{"$nulls":5},"","","","",null,null,"","","",0,""]
["",{"$nulls":5},"","","","",null,null,"","","",0,""]
["",{"$nulls":5},"","","","",null,null,"","","",0,""]
["",{"$nulls":5},"","","","",null,null,"","","",0,""]
["",{"$nulls":5},"","","","",null,null,"","","",0,""]
["",{"$nulls":5},"","","","",null,null,"","","",0,""]
["",{"$nulls":5},"","","","",null,null,"","","",0,""]
["",{"$nulls":5},"","","","",null,null,"","","",0,""]
["",{"$nulls":5},"","","","",null,null,"","","",0,""]
["",{"$nulls":5},"","","","",null,null,"","","",0,""]
["",{"$nulls":5},"","","","",null,null,"","","",0,""]
["",{"$nulls":5},"","","","",null,null,"","","",0,""]
["",{"$nulls":5},"","","","",null,null,"","","",0,""]
["",{"$nulls":5},"","","","",null,null,"","","",0,""]
["",{"$nulls":5},"","","","",null,null,"","","",0,""]
["",{"$nulls":5},"","","","",null,null,"","","",0,""]
["",{"$nulls":5},"","","","",null,null,"","","",0,""]
["",{"$nulls":5},"","","","",null,null,"","","",0,""]
["",{"$nulls":5},"","","","",null,null,"","","",0,""]
["",{"$nulls":5},"","","","",null,null,"","","",0,""]
["",{"$nulls":5},"","","","",null,null,"","","",0,""]
["",{"$nulls":5},"","","","",null,null,"","","",0,""]
["",{"$nulls":5},"","","","",null,null,"","","",0,""]
["",{"$nulls":5},"","","","",null,null,"","","",0,""]
["",{"$nulls":5},"","","","",null,null,"","","",0,""]
["",{"$nulls":5},"","","","",null,null,"","","",0,""]
["",{"$nulls":5},"","","","",null,null,"","","",0,""]
["",{"$nulls":5},{"$f":"IF(ISBLANK(E334),\"\",ROUNDDOWN(E334/10,0))","v":""},{"$f":"IF(ISBLANK(E334),\"\",F334*100/E334)","v":""},{"$f":"IF(ISBLANK(E334),\"\",VLOOKUP(H334,$BT$2:$BW$7,4))","v":""},"",null,null,{"$f":"IF(ISBLANK(K334),\"\",ROUNDDOWN(K334/10,0))","v":""},{"$f":"IF(ISBLANK(K334),\"\",L334*100/K334)","v":""},{"$f":"IF(ISBLANK(K334),\"\",VLOOKUP(N334,$BT$2:$BW$7,4))","v":""},{"$f":"IF(AND(B334<>\"\",C334<>\"\",OR(E334>0,K334>0)),1,0)","v":0},{"$f":"IF(P334,$P$11,\"\")","v":""}]
["",{"$nulls":5},"","","",{"$f":"IF(ISBLANK(D335),\"\",IF(($J$11-D335)>15,\"a. K.\",($J$11-D335)))","v":""},null,null,"","","",0,""]
[{"$f":"IF(ISBLANK(B336),\"\",1+A335)","v":""},{"$nulls":5},"","","","",null,null,"","","",0,""]
["",{"$nulls":5},"","","","",null,null,"","","",0,""]
["",{"$nulls":5},"","","","",null,null,"","","",0,""]
["",{"$nulls":5},"","","","",null,null,"","","",0,""]
["",{"$nulls":5},"","","","",null,null,"","","",0,""]
["",{"$nulls":5},"","","","",null,null,"","","",0,""]
["",{"$nulls":5},"","","","",null,null,"","","",0,""]
["",{"$nulls":5},"","","","",null,null,"","","",0,""]
["",{"$nulls":5},"","","","",null,null,"","","",0,""]
["",{"$nulls":5},"","","","",null,null,"","","",0,""]
["",{"$nulls":5},"","","","",null,null,"","","",0,""]
["",{"$nulls":5},"","","","",null,null,"","","",0,""]
["",{"$nulls":5},"","","","",null,null,"","","",0,""]
["",{"$nulls":5},"","","","",null,null,"","","",0,""]
["",{"$nulls":5},"","","","",null,null,"","","",0,""]
["",{"$nulls":5},"","","","",null,null,"","","",0,""]
["",{"$nulls":5},"","","","",null,null,"","","",0,""]
["",{"$nulls":5},"","","","",null,null,"","","",0,""]
["",{"$nulls":5},"","","","",null,null,"","","",0,""]
["",{"$nulls":5},"","","","",null,null,"","","",0,""]
["",{"$nulls":5},"","","","",null,null,"","","",0,""]
["",{"$nulls":5},"","","","",null,null,"","","",0,""]
["",{"$nulls":5},"","","","",null,null,"","","",0,""]
["",{"$nulls":5},"","","","",null,null,"","","",0,""]
["",{"$nulls":5},"","","","",null,null,"","","",0,""]
["",{"$nulls":5},"","","","",null,null,"","","",0,""]
["",{"$nulls":5},"","","","",null,null,"","","",0,""]
["",{"$nulls":5},"","","","",null,null,"","","",0,""]
["",{"$nulls":5},"","","","",null,null,"","","",0,""]
["",{"$nulls":5},"","","","",null,null,"","","",0,""]
["",{"$nulls":5},"","","","",null,null,"","","",0,""]
["",{"$nulls":5},"","","","",null,null,"","","",0,""]
["",{"$nulls":5},"","","","",null,null,"","","",0,""]
["",{"$nulls":5},"","","","",null,null,"","","",0,""]
["",{"$nulls":5},"","","","",null,null,"","","",0,""]
["",{"$nulls":5},"","","","",null,null,"","","",0,""]
["",{"$nulls":5},"","","","",null,null,"","","",0,""]
["",{"$nulls":5},"","","","",null,null,"","","",0,""]
["",{"$nulls":5},"","","","",null,null,"","","",0,""]
["",{"$nulls":5},"","","","",null,null,"","","",0,""]
["",{"$nulls":5},"","","","",null,null,"","","",0,""]
["",{"$nulls":5},"","","","",null,null,"","","",0,""]
["",{"$nulls":5},"","","","",null,null,"","","",0,""]
["",{"$nulls":5},"","","","",null,null,"","","",0,""]
["",{"$nulls":5},"","","","",null,null,"","","",0,""]
["",{"$nulls":5},"","","","",null,null,"","","",0,""]
["",{"$nulls":5},"","","","",null,null,"","","",0,""]
["",{"$nulls":5},"","","","",null,null,"","","",0,""]
["",{"$nulls":5},"","","","",null,null,"","","",0,""]
["",{"$nulls":5},"","","","",null,null,"","","",0,""]
["",{"$nulls":5},"","","","",null,null,"","","",0,""]
["",{"$nulls":5},"","","","",null,null,"","","",0,""]
["",{"$nulls":5},"","","","",null,null,"","","",0,""]
["",{"$nulls":5},"","","","",null,null,"","","",0,""]
["",{"$nulls":5},"","","","",null,null,"","","",0,""]
["",{"$nulls":5},"","","","",null,null,"","","",0,""]
["",{"$nulls":5},"","","","",null,null,"","","",0,""]
["",{"$nulls":5},"","","","",null,null,"","","",0,""]
["",{"$nulls":5},"","","","",null,null,"","","",0,""]
["",{"$nulls":5},"","","","",null,null,"","","",0,""]
["",{"$nulls":5},"","","","",null,null,"","","",0,""]
["",{"$nulls":5},"","","","",null,null,"","","",0,""]
["",{"$nulls":5},{"$f":"IF(ISBLANK(E398),\"\",ROUNDDOWN(E398/10,0))","v":""},{"$f":"IF(ISBLANK(E398),\"\",F398*100/E398)","v":""},{"$f":"IF(ISBLANK(E398),\"\",VLOOKUP(H398,$BT$2:$BW$7,4))","v":""},"",null,null,{"$f":"IF(ISBLANK(K398),\"\",ROUNDDOWN(K398/10,0))","v":""},{"$f":"IF(ISBLANK(K398),\"\",L398*100/K398)","v":""},{"$f":"IF(ISBLANK(K398),\"\",VLOOKUP(N398,$BT$2:$BW$7,4))","v":""},{"$f":"IF(AND(B398<>\"\",C398<>\"\",OR(E398>0,K398>0)),1,0)","v":0},{"$f":"IF(P398,$P$11,\"\")","v":""}]
["",{"$nulls":5},"","","",{"$f":"IF(ISBLANK(D399),\"\",IF(($J$11-D399)>15,\"a. K.\",($J$11-D399)))","v":""},null,null,"","","",0,""]
[{"$f":"IF(ISBLANK(B400),\"\",1+A399)","v":""},{"$nulls":5},"","","","",null,null,"","","",0,""]
["",{"$nulls":5},"","","","",null,null,"","","",0,""]
["",{"$nulls":5},"","","","",null,null,"","","",0,""]
["",{"$nulls":5},"","","","",null,null,"","","",0,""]
["",{"$nulls":5},"","","","",null,null,"","","",0,""]
["",{"$nulls":5},"","","","",null,null,"","","",0,""]
["",{"$nulls":5},"","","","",null,null,"","","",0,""]
["",{"$nulls":5},"","","","",null,null,"","","",0,""]
["",{"$nulls":5},"","","","",null,null,"","","",0,""]
["",{"$nulls":5},"","","","",null,null,"","","",0,""]
["",{"$nulls":5},"","","","",null,null,"","","",0,""]
["",{"$nulls":5},"","","","",null,null,"","","",0,""]
["",{"$nulls":5},"","","","",null,null,"","","",0,""]
["",{"$nulls":5},"","","","",null,null,"","","",0,""]
["",{"$nulls":5},"","","","",null,null,"","","",0,""]
["",{"$nulls":5},"","","","",null,null,"","","",0,""]
["",{"$nulls":5},"","","","",null,null,"","","",0,""]
["",{"$nulls":5},"","","","",null,null,"","","",0,""]
["",{"$nulls":5},"","","","",null,null,"","","",0,""]
["",{"$nulls":5},"","","","",null,null,"","","",0,""]
["",{"$nulls":5},"","","","",null,null,"","","",0,""]
["",{"$nulls":5},"","","","",null,null,"","","",0,""]
["",{"$nulls":5},"","","","",null,null,"","","",0,""]
["",{"$nulls":5},"","","","",null,null,"","","",0,""]
["",{"$nulls":5},"","","","",null,null,"","","",0,""]
["",{"$nulls":5},"","","","",null,null,"","","",0,""]
["",{"$nulls":5},"","","","",null,null,"","","",0,""]
["",{"$nulls":5},"","","","",null,null,"","","",0,""]
["",{"$nulls":5},"","","","",null,null,"","","",0,""]
["",{"$nulls":5},"","","","",null,null,"","","",0,""]
["",{"$nulls":5},"","","","",null,null,"","","",0,""]
["",{"$nulls":5},"","","","",null,null,"","","",0,""]
["",{"$nulls":5},"","","","",null,null,"","","",0,""]
["",{"$nulls":5},"","","","",null,null,"","","",0,""]
["",{"$nulls":5},"","","","",null,null,"","","",0,""]
["",{"$nulls":5},"","","","",null,null,"","","",0,""]
["",{"$nulls":5},"","","","",null,null,"","","",0,""]
["",{"$nulls":5},"","","","",null,null,"","","",0,""]
["",{"$nulls":5},"","","","",null,null,"","","",0,""]
["",{"$nulls":5},"","","","",null,null,"","","",0,""]
["",{"$nulls":5},"","","","",null,null,"","","",0,""]
["",{"$nulls":5},"","","","",null,null,"","","",0,""]
["",{"$nulls":5},"","","","",null,null,"","","",0,""]
["",{"$nulls":5},"","","","",null,null,"","","",0,""]
["",{"$nulls":5},"","","","",null,null,"","","",0,""]
["",{"$nulls":5},"","","","",null,null,"","","",0,""]
["",{"$nulls":5},"","","","",null,null,"","","",0,""]
["",{"$nulls":5},"","","","",null,null,"","","",0,""]
["",{"$nulls":5},"","","","",null,null,"","","",0,""]
["",{"$nulls":5},"","","","",null,null,"","","",0,""]
["",{"$nulls":5},"","","","",null,null,"","","",0,""]
["",{"$nulls":5},"","","","",null,null,"","","",0,""]
["",{"$nulls":5},"","","","",null,null,"","","",0,""]
["",{"$nulls":5},"","","","",null,null,"","","",0,""]
["",{"$nulls":5},"","","","",null,null,"","","",0,""]
["",{"$nulls":5},"","","","",null,null,"","","",0,""]
["",{"$nulls":5},"","","","",null,null,"","","",0,""]
["",{"$nulls":5},"","","","",null,null,"","","",0,""]
["",{"$nulls":5},"","","","",null,null,"","","",0,""]
["",{"$nulls":5},"","","","",null,null,"","","",0,""]
["",{"$nulls":5},"","","","",null,null,"","","",0,""]
["",{"$nulls":5},"","","","",null,null,"","","",0,""]
["",{"$nulls":5},{"$f":"IF(ISBLANK(E462),\"\",ROUNDDOWN(E462/10,0))","v":""},{"$f":"IF(ISBLANK(E462),\"\",F462*100/E462)","v":""},{"$f":"IF(ISBLANK(E462),\"\",VLOOKUP(H462,$BT$2:$BW$7,4))","v":""},"",null,null,{"$f":"IF(ISBLANK(K462),\"\",ROUNDDOWN(K462/10,0))","v":""},{"$f":"IF(ISBLANK(K462),\"\",L462*100/K462)","v":""},{"$f":"IF(ISBLANK(K462),\"\",VLOOKUP(N462,$BT$2:$BW$7,4))","v":""},{"$f":"IF(AND(B462<>\"\",C462<>\"\",OR(E462>0,K462>0)),1,0)","v":0},{"$f":"IF(P462,$P$11,\"\")","v":""}]
["",{"$nulls":5},"","","",{"$f":"IF(ISBLANK(D463),\"\",IF(($J$11-D463)>15,\"a. K.\",($J$11-D463)))","v":""},null,null,"","","",0,""]
[{"$f":"IF(ISBLANK(B464),\"\",1+A463)","v":""},{"$nulls":5},"","","","",null,null,"","","",0,""]
["",{"$nulls":5},"","","","",null,null,"","","",0,""]
["",{"$nulls":5},"","","","",null,null,"","","",0,""]
["",{"$nulls":5},"","","","",null,null,"","","",0,""]
["",{"$nulls":5},"","","","",null,null,"","","",0,""]
["",{"$nulls":5},"","","","",null,null,"","","",0,""]
["",{"$nulls":5},"","","","",null,null,"","","",0,""]
["",{"$nulls":5},"","","","",null,null,"","","",0,""]
["",{"$nulls":5},"","","","",null,null,"","","",0,""]
["",{"$nulls":5},"","","","",null,null,"","","",0,""]
["",{"$nulls":5},"","","","",null,null,"","","",0,""]
["",{"$nulls":5},"","","","",null,null,"","","",0,""]
["",{"$nulls":5},"","","","",null,null,"","","",0,""]
["",{"$nulls":5},"","","","",null,null,"","","",0,""]
["",{"$nulls":5},"","","","",null,null,"","","",0,""]
["",{"$nulls":5},"","","","",null,null,"","","",0,""]
["",{"$nulls":5},"","","","",null,null,"","","",0,""]
["",{"$nulls":5},"","","","",null,null,"","","",0,""]
["",{"$nulls":5},"","","","",null,null,"","","",0,""]
["",{"$nulls":5},"","","","",null,null,"","","",0,""]
["",{"$nulls":5},"","","","",null,null,"","","",0,""]
["",{"$nulls":5},"","","","",null,null,"","","",0,""]
["",{"$nulls":5},"","","","",null,null,"","","",0,""]
["",{"$nulls":5},"","","","",null,null,"","","",0,""]
["",{"$nulls":5},"","","","",null,null,"","","",0,""]
["",{"$nulls":5},"","","","",null,null,"","","",0,""]
["",{"$nulls":5},"","","","",null,null,"","","",0,""]
["",{"$nulls":5},"","","","",null,null,"","","",0,""]
["",{"$nulls":5},"","","","",null,null,"","","",0,""]
["",{"$nulls":5},"","","","",null,null,"","","",0,""]
["",{"$nulls":5},"","","","",null,null,"","","",0,""]
["",{"$nulls":5},"","","","",null,null,"","","",0,""]
["",{"$nulls":5},"","","","",null,null,"","","",0,""]
["",{"$nulls":5},"","","","",null,null,"","","",0,""]
["",{"$nulls":5},"","","","",null,null,"","","",0,""]
["",{"$nulls":5},"","","","",null,null,"","","",0,""]
["",{"$nulls":5},"","","","",null,null,"","","",0,""]
["",{"$nulls":5},"","","","",null,null,"","","",0,""]
[{"$f":"IF(ISBLANK(B502),\"\",1+A501)","v":""},{"$nulls":5},"","","","",null,null,"","","",0,""]
[{"$f":"IF(ISBLANK(B503),\"\",1+A502)","v":""},{"$nulls":5},"","","","",null,null,"","","",0,""]
[{"$f":"IF(ISBLANK(B504),\"\",1+A503)","v":""},{"$nulls":5},"","","","",null,null,"","","",0,""]

{"sheet":"außerhalb RLP - TN ab 16 Jahre","index":2,"n_rows":504,"n_cols":81,"rows_kept":504,"merged":[[0,2,0,7],[0,12,0,14],[1,2,1,7],[2,2,2,7],[2,10,2,14],[3,2,3,7],[4,2,4,7],[5,3,5,7],[5,10,5,14],[6,3,6,7],[6,17,7,17],[7,2,7,7],[7,9,7,14],[8,2,8,7],[8,11,9,14],[8,16,9,16],[8,17,9,17],[9,0,9,10],[10,0,10,1]]}
["Schule:",{"$nulls":8},"Kenn-Nr.:",null,".",{"$nulls":4},{"$f":"IF(ISBLANK(K1),\"Bitte Kenn-Nr. eintragen!\",\"\")","v":"Bitte Kenn-Nr. eintragen!"},{"$nulls":52},"Anrede",null,"Wertung",{"$nulls":6},"Preisstaffelung"]
["Zusatzangabe:",{"$nulls":9},{"$f":"IF(ISBLANK(K3),\"Bitte Schulart eintragen!\",\"\")","v":"Bitte Schulart eintragen!"},{"$nulls":5},{"$f":"IF(ISBLANK(R3),\"Bitte Datum eintragen!\",\"\")","v":"Bitte Datum eintragen!"},{"$nulls":52},"Frau",null,{"v":0,"d":"0.000"},"-",{"v":0.08,"d":"0.080"},1,{"$nulls":3},"ab",0,{"v":3,"d":"3.00 €"}]
["Straße/Hausnummer:",{"$nulls":8},"Schulart:",{"$nulls":6},"Datum:",{"$nulls":52},"Herr",null,{"v":0.0801,"d":"0.080"},"-",{"v":0.19,"d":"0.190"},2,{"$nulls":3},"ab",50,{"v":2.5,"d":"2.50 €"}]
["PLZ:",{"$nulls":8},"Anrede:","Vor-/Zuname der Lehrkraft",{"$nulls":3},{"$f":"IF(ISBLANK(R6),\"Bitte Tel.-Nr. für kurzfristige Rückfragen angeben!\",\"\")","v":"Bitte Tel.-Nr. für kurzfristige Rückfragen angeben!"},{"$nulls":56},{"v":0.1901,"d":"0.190"},"-",{"v":0.33,"d":"0.330"},3,{"$nulls":3},"ab",100,{"v":2,"d":"2.00 €"}]
["Ort:"]
["Telefon: (dienst.)",{"$nulls":15},"Tel.:(privat)",{"$nulls":54},{"v":0.3301,"d":"0.330"},"-",{"v":0.5,"d":"0.500"},4]
["Fax:",{"$nulls":8},"E-Mail:",{"$nulls":59},"Wert",null,{"v":0.5001,"d":"0.500"},"-",null,"TN"]
["Bundesland/Land:",{"$nulls":15},"Anmerkungen",{"$nulls":54},"TN","=","Teilnahme"]
["Sonstiges Land:",{"$nulls":10},"Gesamt",{"$nulls":3},{"$f":"SUM(P13:P504)","v":0},{"$f":"P9","v":0},"Wettschreib-Teilnehmer"]
["Teilnehmer außerhalb von RLP über 15 Jahre!"]
[{"$f":"H11+N11","v":0},null,"Punkte für die Schule",{"$f":"TODAY()","v":"2019-01-09"},"Landessprache",null,null,{"$f":"COUNT(F13:F504)","v":0},null,2019,"Fremdsprache",null,null,{"$f":"COUNT(L13:L504)","v":0},null,{"$f":"VLOOKUP(P9,CB2:CC4,2)","v":{"v":3,"d":"3.00 €"}},{"$f":"IF((P11*Q9)<10,10,P11*Q9)","v":{"v":10,"d":"10.00 €"}},"zu zahlender Gesamtbetrag"]
["Lfd.-Nr.","Nachname\nausgeschrieben","Vorname ausgeschrieben","Geburtsjahr\n4-stellig angeben","Gesamt-anschläge","Fehler","Minuten-An-schläge","Quotient","Note","ohne Alters-angabe\na. K.","Gesamt-anschläge","Fehler","Minuten-An-schläge","Quotient","Note","TN","Teilnehmer-Gebühren","sonstige schulinterne Angaben"]
[1,{"$nulls":5},{"$f":"IF(ISBLANK(E13),\"\",ROUNDDOWN(E13/10,0))","v":""},{"$f":"IF(ISBLANK(E13),\"\",F13*100/E13)","v":""},{"$f":"IF(ISBLANK(E13),\"\",VLOOKUP(H13,$BT$2:$BW$7,4))","v":""},{"$f":"IF(ISBLANK(D13),\"\",IF(($J$11-D13)<16,\"a. K.\",IF(($J$11-D13)>24,\"a. K.\",($J$11-D13))))","v":""},null,null,{"$f":"IF(ISBLANK(K13),\"\",ROUNDDOWN(K13/10,0))","v":""},{"$f":"IF(ISBLANK(K13),\"\",L13*100/K13)","v":""},{"$f":"IF(ISBLANK(K13),\"\",VLOOKUP(N13,$BT$2:$BW$7,4))","v":""},{"$f":"IF(AND(B13<>\"\",C13<>\"\",OR(E13>0,K13>0)),1,0)","v":0},{"$f":"IF(P13,$P$11,\"\")","v":""},{"$nulls":52},"Werte",null,"Schulart:",null,null,"Land/Bundesland:"]
[{"$f":"IF(ISBLANK(B14),\"\",1+A13)","v":""},{"$nulls":5},{"$f":"IF(ISBLANK(E14),\"\",ROUNDDOWN(E14/10,0))","v":""},{"$f":"IF(ISBLANK(E14),\"\",F14*100/E14)","v":""},{"$f":"IF(ISBLANK(E14),\"\",VLOOKUP(H14,$BT$2:$BW$7,4))","v":""},{"$f":"IF(ISBLANK(D14),\"\",IF(AND($J$11-D14<25),$J$11-D14,\"a. K.\"))","v":""},null,null,{"$f":"IF(ISBLANK(K14),\"\",ROUNDDOWN(K14/10,0))","v":""},{"$f":"IF(ISBLANK(K14),\"\",L14*100/K14)","v":""},{"$f":"IF(ISBLANK(K14),\"\",VLOOKUP(N14,$BT$2:$BW$7,4))","v":""},{"$f":"IF(AND(B14<>\"\",C14<>\"\",OR(E14>0,K14>0)),1,0)","v":0},{"$f":"IF(P14,$P$11,\"\")","v":""},{"$nulls":52},10,null,"BBS/BFS",null,null,"Belgien",null,null,"B         - Belgien"]
[{"$f":"IF(ISBLANK(B15),\"\",1+A14)","v":""},{"$nulls":5},"","","","",null,null,"","","",0,"",{"$nulls":52},11,null,"Gymnasium",null,null,"Berlin",null,null,"BLN     - Berlin"]
[{"$f":"IF(ISBLANK(B16),\"\",1+A15)","v":""},{"$nulls":5},"","","","",null,null,"","","",0,"",{"$nulls":52},20,null,"Realschule+/IGS",null,null,"Brandenburg",null,null,"BRA     - Brandenburg"]
["",{"$nulls":5},"","","","",null,null,"","","",0,"",{"$nulls":52},30,null,"Grundschule",null,null,"Bremen",null,null,"BR       - Bremen"]
["",{"$nulls":5},"","","","",null,null,"","","",0,"",{"$nulls":52},40,null,"Förderschule",null,null,"Baden-Württemberg",null,null,"BW      - Baden-Württemberg"]
["",{"$nulls":5},"","","","",null,null,"","","",0,"",{"$nulls":52},50,null,"Verein",null,null,"Bayern",null,null,"BY       - Bayern"]
["",{"$nulls":5},"","","","",null,null,"","","",0,"",{"$nulls":54},"VHS",null,null,"Schweiz",null,null,"CH       - Schweiz"]
["",{"$nulls":5},"","","","",null,null,"","","",0,"",{"$nulls":54},"freier Bildungsträger",null,null,"Hessen",null,null,"HE       - Hessen"]
["",{"$nulls":5},"","","","",null,null,"","","",0,"",{"$nulls":54},"Privatschule",null,null,"Hamburg",null,null,"HH       - Hamburg"]
["",{"$nulls":5},"","","","",null,null,"","","",0,"",{"$nulls":54},"Hauptschule",null,null,"Mecklenburg-Vorpommern",null,null,"MEVO  - Mecklenburg-Vorpommern"]
["",{"$nulls":5},"","","","",null,null,"","","",0,"",{"$nulls":54},"Mittelschule",null,null,"Niedersachsen",null,null,"NI         - Niedersachsen"]
["",{"$nulls":5},"","","","",null,null,"","","",0,"",{"$nulls":54},"sonstige Schulart",null,null,"Niederlande",null,null,"NL        - Niederlande"]
["",{"$nulls":5},"","","","",null,null,"","","",0,"",{"$nulls":57},"Nordrhein-Westfalen",null,null,"NRW    - Nordrhein-Westfalen"]
["",{"$nulls":5},"","","","",null,null,"","","",0,"",{"$nulls":60},"RLP      - Rheinland-Pfalz"]
["",{"$nulls":5},"","","","",null,null,"","","",0,"",{"$nulls":57},"Saarland",null,null,"SA        - Sachsen"]
["",{"$nulls":5},"","","","",null,null,"","","",0,"",{"$nulls":57},"Sachsen",null,null,"SAAN   - Sachsen-Anhalt"]
["",{"$nulls":5},"","","","",null,null,"","","",0,"",{"$nulls":57},"Sachsen-Anhalt",null,null,"SH       - Schleswig-Holstein"]
["",{"$nulls":5},"","","","",null,null,"","","",0,"",{"$nulls":57},"Schleswig-Holstein",null,null,"SL        - Saarland"]
["",{"$nulls":5},"","","","",null,null,"","","",0,"",{"$nulls":57},"Thüringen",null,null,"TH       - Thüringen"]
["",{"$nulls":5},"","","","",null,null,"","","",0,"",{"$nulls":57},"Sonstiges",null,null,"So        - Sonstiges"]
["",{"$nulls":5},"","","","",null,null,"","","",0,"",{"$nulls":54},"Anrede:"]
["",{"$nulls":5},"","","","",null,null,"","","",0,"",{"$nulls":54},"Frau"]
["",{"$nulls":5},"","","","",null,null,"","","",0,"",{"$nulls":54},"Herr"]
["",{"$nulls":5},"","","","",null,null,"","","",0,""]
["",{"$nulls":5},"","","","",null,null,"","","",0,"",{"$nulls":54},"Schul-Kenn-Nr.:",null,"Schule in/außerhalb"]
["",{"$nulls":5},"","","","",null,null,"","","",0,"",{"$nulls":54},10,null,"Schulen in Rheinland-Pfalz"]
["",{"$nulls":5},"","","","",null,null,"","","",0,"",{"$nulls":54},20,null,"Schulen im Ausland"]
["",{"$nulls":5},"","","","",null,null,"","","",0,"",{"$nulls":54},30,null,"Schulen außerhalb von RLP"]
["",{"$nulls":5},"","","","",null,null,"","","",0,"",{"$nulls":54},40]
["",{"$nulls":5},"","","","",null,null,"","","",0,"",{"$nulls":54},50]
["",{"$nulls":5},"","","","",null,null,"","","",0,"",{"$nulls":54},60]
["",{"$nulls":5},"","","","",null,null,"","","",0,"",{"$nulls":54},70]
["",{"$nulls":5},"","","","",null,null,"","","",0,"",{"$nulls":54},80]
["",{"$nulls":5},"","","","",null,null,"","","",0,"",{"$nulls":54},90]
["",{"$nulls":5},"","","","",null,null,"","","",0,""]
["",{"$nulls":5},"","","","",null,null,"","","",0,"",{"$nulls":54},11,null,"BBS/BFS"]
["",{"$nulls":5},"","","","",null,null,"","","",0,"",{"$nulls":54},12,null,"Gymnasium"]
["",{"$nulls":5},"","","","",null,null,"","","",0,"",{"$nulls":54},13,null,"Realschule +/IGS"]
["",{"$nulls":5},"","","","",null,null,"","","",0,"",{"$nulls":54},14,null,"Grundschule - Primärstufe"]
["",{"$nulls":5},"","","","",null,null,"","","",0,"",{"$nulls":54},15,null,"Förderschule - motorischer Hintergrund"]
["",{"$nulls":5},"","","","",null,null,"","","",0,"",{"$nulls":54},16,null,"freie Bildungsträger"]
["",{"$nulls":5},"","","","",null,null,"","","",0,"",{"$nulls":54},17,null,"VHS - Erwachsenenbildung"]
["",{"$nulls":5},"","","","",null,null,"","","",0,"",{"$nulls":54},18,null,"Vereine"]
["",{"$nulls":5},"","","","",null,null,"","","",0,"",{"$nulls":54},19,null,"sonstige"]
["",{"$nulls":5},"","","","",null,null,"","","",0,""]
["",{"$nulls":5},"","","","",null,null,"","","",0,"",{"$nulls":54},21,null,"BBS/BFS"]
["",{"$nulls":5},"","","","",null,null,"","","",0,"",{"$nulls":54},22,null,"Gymnasium"]
["",{"$nulls":5},"","","","",null,null,"","","",0,"",{"$nulls":54},23,null,"Realschule +/IGS"]
["",{"$nulls":5},"","","","",null,null,"","","",0,"",{"$nulls":54},24,null,"Grundschule - Primärstufe"]
["",{"$nulls":5},"","","","",null,null,"","","",0,"",{"$nulls":54},25,null,"Förderschule - motorischer Hintergrund"]
["",{"$nulls":5},"","","","",null,null,"","","",0,"",{"$nulls":54},26,null,"freie Bildungsträger"]
["",{"$nulls":5},"","","","",null,null,"","","",0,"",{"$nulls":54},27,null,"VHS - Erwachsenenbildung"]
["",{"$nulls":5},"","","","",null,null,"","","",0,"",{"$nulls":54},28,null,"Vereine"]
["",{"$nulls":5},"","","","",null,null,"","","",0,"",{"$nulls":54},29,null,"sonstige"]
["",{"$nulls":5},"","","","",null,null,"","","",0,""]
["",{"$nulls":5},"","","","",null,null,"","","",0,"",{"$nulls":54},31,null,"BBS/BFS"]
["",{"$nulls":5},"","","","",null,null,"","","",0,"",{"$nulls":54},32,null,"Gymnasium"]
["",{"$nulls":5},"","","","",null,null,"","","",0,"",{"$nulls":54},33,null,"Realschule +/IGS"]
["",{"$nulls":5},"","","","",null,null,"","","",0,"",{"$nulls":54},34,null,"Grundschule - Primärstufe"]
["",{"$nulls":5},"","","","",null,null,"","","",0,"",{"$nulls":54},35,null,"Förderschule - motorischer Hintergrund"]
["",{"$nulls":5},"","","","",null,null,"","","",0,"",{"$nulls":54},36,null,"freie Bildungsträger"]
["",{"$nulls":5},"","","","",null,null,"","","",0,"",{"$nulls":54},37,null,"VHS - Erwachsenenbildung"]
["",{"$nulls":5},"","","","",null,null,"","","",0,"",{"$nulls":54},38,null,"Vereine"]
["",{"$nulls":5},"","","","",null,null,"","","",0,"",{"$nulls":54},39,null,"sonstige"]
["",{"$nulls":5},{"$f":"IF(ISBLANK(E78),\"\",ROUNDDOWN(E78/10,0))","v":""},{"$f":"IF(ISBLANK(E78),\"\",F78*100/E78)","v":""},{"$f":"IF(ISBLANK(E78),\"\",VLOOKUP(H78,$BT$2:$BW$7,4))","v":""},{"$f":"IF(ISBLANK(D78),\"\",IF(AND($J$11-D78<25),$J$11-D78,\"a. K.\"))","v":""},null,null,{"$f":"IF(ISBLANK(K78),\"\",ROUNDDOWN(K78/10,0))","v":""},{"$f":"IF(ISBLANK(K78),\"\",L78*100/K78)","v":""},{"$f":"IF(ISBLANK(K78),\"\",VLOOKUP(N78,$BT$2:$BW$7,4))","v":""},{"$f":"IF(AND(B78<>\"\",C78<>\"\",OR(E78>0,K78>0)),1,0)","v":0},{"$f":"IF(P78,$P$11,\"\")","v":""}]
["",{"$nulls":5},"","","","",null,null,"","","",0,""]
[{"$f":"IF(ISBLANK(B80),\"\",1+A79)","v":""},{"$nulls":5},"","","","",null,null,"","","",0,""]
["",{"$nulls":5},"","","","",null,null,"","","",0,""]
["",{"$nulls":5},"","","","",null,null,"","","",0,""]
["",{"$nulls":5},"","","","",null,null,"","","",0,""]
["",{"$nulls":5},"","","","",null,null,"","","",0,""]
["",{"$nulls":5},"","","","",null,null,"","","",0,""]
["",{"$nulls":5},"","","","",null,null,"","","",0,""]
["",{"$nulls":5},"","","","",null,null,"","","",0,""]
["",{"$nulls":5},"","","","",null,null,"","","",0,""]
["",{"$nulls":5},"","","","",null,null,"","","",0,""]
["",{"$nulls":5},"","","","",null,null,"","","",0,""]
["",{"$nulls":5},"","","","",null,null,"","","",0,""]
["",{"$nulls":5},"","","","",null,null,"","","",0,""]
["",{"$nulls":5},"","","","",null,null,"","","",0,""]
["",{"$nulls":5},"","","","",null,null,"","","",0,""]
["",{"$nulls":5},"","","","",null,null,"","","",0,""]
["",{"$nulls":5},"","","","",null,null,"","","",0,""]
["",{"$nulls":5},"","","","",null,null,"","","",0,""]
["",{"$nulls":5},"","","","",null,null,"","","",0,""]
["",{"$nulls":5},"","","","",null,null,"","","",0,""]
["",{"$nulls":5},"","","","",null,null,"","","",0,""]
["",{"$nulls":5},"","","","",null,null,"","","",0,""]
["",{"$nulls":5},"","","","",null,null,"","","",0,""]
["",{"$nulls":5},"","","","",null,null,"","","",0,""]
["",{"$nulls":5},"","","","",null,null,"","","",0,""]
["",{"$nulls":5},"","","","",null,null,"","","",0,""]
["",{"$nulls":5},"","","","",null,null,"","","",0,""]
["",{"$nulls":5},"","","","",null,null,"","","",0,""]
["",{"$nulls":5},"","","","",null,null,"","","",0,""]
["",{"$nulls":5},"","","","",null,null,"","","",0,""]
["",{"$nulls":5},"","","","",null,null,"","","",0,""]
["",{"$nulls":5},"","","","",null,null,"","","",0,""]
["",{"$nulls":5},"","","","",null,null,"","","",0,""]
["",{"$nulls":5},"","","","",null,null,"","","",0,""]
["",{"$nulls":5},"","","","",null,null,"","","",0,""]
["",{"$nulls":5},"","","","",null,null,"","","",0,""]
["",{"$nulls":5},"","","","",null,null,"","","",0,""]
["",{"$nulls":5},"","","","",null,null,"","","",0,""]
["",{"$nulls":5},"","","","",null,null,"","","",0,""]
["",{"$nulls":5},"","","","",null,null,"","","",0,""]
["",{"$nulls":5},"","","","",null,null,"","","",0,""]
["",{"$nulls":5},"","","","",null,null,"","","",0,""]
["",{"$nulls":5},"","","","",null,null,"","","",0,""]
["",{"$nulls":5},"","","","",null,null,"","","",0,""]
["",{"$nulls":5},"","","","",null,null,"","","",0,""]
["",{"$nulls":5},"","","","",null,null,"","","",0,""]
["",{"$nulls":5},"","","","",null,null,"","","",0,""]
["",{"$nulls":5},"","","","",null,null,"","","",0,""]
["",{"$nulls":5},"","","","",null,null,"","","",0,""]
["",{"$nulls":5},"","","","",null,null,"","","",0,""]
["",{"$nulls":5},"","","","",null,null,"","","",0,""]
["",{"$nulls":5},"","","","",null,null,"","","",0,""]
["",{"$nulls":5},"","","","",null,null,"","","",0,""]
["",{"$nulls":5},"","","","",null,null,"","","",0,""]
["",{"$nulls":5},"","","","",null,null,"","","",0,""]
["",{"$nulls":5},"","","","",null,null,"","","",0,""]
["",{"$nulls":5},"","","","",null,null,"","","",0,""]
["",{"$nulls":5},"","","","",null,null,"","","",0,""]
["",{"$nulls":5},"","","","",null,null,"","","",0,""]
["",{"$nulls":5},"","","","",null,null,"","","",0,""]
["",{"$nulls":5},"","","","",null,null,"","","",0,""]
["",{"$nulls":5},"","","","",null,null,"","","",0,""]
["",{"$nulls":5},{"$f":"IF(ISBLANK(E142),\"\",ROUNDDOWN(E142/10,0))","v":""},{"$f":"IF(ISBLANK(E142),\"\",F142*100/E142)","v":""},{"$f":"IF(ISBLANK(E142),\"\",VLOOKUP(H142,$BT$2:$BW$7,4))","v":""},{"$f":"IF(ISBLANK(D142),\"\",IF(AND($J$11-D142<25),$J$11-D142,\"a. K.\"))","v":""},null,null,{"$f":"IF(ISBLANK(K142),\"\",ROUNDDOWN(K142/10,0))","v":""},{"$f":"IF(ISBLANK(K142),\"\",L142*100/K142)","v":""},{"$f":"IF(ISBLANK(K142),\"\",VLOOKUP(N142,$BT$2:$BW$7,4))","v":""},{"$f":"IF(AND(B142<>\"\",C142<>\"\",OR(E142>0,K142>0)),1,0)","v":0},{"$f":"IF(P142,$P$11,\"\")","v":""}]
["",{"$nulls":5},"","","","",null,null,"","","",0,""]
[{"$f":"IF(ISBLANK(B144),\"\",1+A143)","v":""},{"$nulls":5},"","","","",null,null,"","","",0,""]
["",{"$nulls":5},"","","","",null,null,"","","",0,""]
["",{"$nulls":5},"","","","",null,null,"","","",0,""]
["",{"$nulls":5},"","","","",null,null,"","","",0,""]
["",{"$nulls":5},"","","","",null,null,"","","",0,""]
["",{"$nulls":5},"","","","",null,null,"","","",0,""]
["",{"$nulls":5},"","","","",null,null,"","","",0,""]
["",{"$nulls":5},"","","","",null,null,"","","",0,""]
["",{"$nulls":5},"","","","",null,null,"","","",0,""]
["",{"$nulls":5},"","","","",null,null,"","","",0,""]
["",{"$nulls":5},"","","","",null,null,"","","",0,""]
["",{"$nulls":5},"","","","",null,null,"","","",0,""]
["",{"$nulls":5},"","","","",null,null,"","","",0,""]
["",{"$nulls":5},"","","","",null,null,"","","",0,""]
["",{"$nulls":5},"","","","",null,null,"","","",0,""]
["",{"$nulls":5},"","","","",null,null,"","","",0,""]
["",{"$nulls":5},"","","","",null,null,"","","",0,""]
["",{"$nulls":5},"","","","",null,null,"","","",0,""]
["",{"$nulls":5},"","","","",null,null,"","","",0,""]
["",{"$nulls":5},"","","","",null,null,"","","",0,""]
["",{"$nulls":5},"","","","",null,null,"","","",0,""]
["",{"$nulls":5},"","","","",null,null,"","","",0,""]
["",{"$nulls":5},"","","","",null,null,"","","",0,""]
["",{"$nulls":5},"","","","",null,null,"","","",0,""]
["",{"$nulls":5},"","","","",null,null,"","","",0,""]
["",{"$nulls":5},"","","","",null,null,"","","",0,""]
["",{"$nulls":5},"","","","",null,null,"","","",0,""]
["",{"$nulls":5},"","","","",null,null,"","","",0,""]
["",{"$nulls":5},"","","","",null,null,"","","",0,""]
["",{"$nulls":5},"","","","",null,null,"","","",0,""]
["",{"$nulls":5},"","","","",null,null,"","","",0,""]
["",{"$nulls":5},"","","","",null,null,"","","",0,""]
["",{"$nulls":5},"","","","",null,null,"","","",0,""]
["",{"$nulls":5},"","","","",null,null,"","","",0,""]
["",{"$nulls":5},"","","","",null,null,"","","",0,""]
["",{"$nulls":5},"","","","",null,null,"","","",0,""]
["",{"$nulls":5},"","","","",null,null,"","","",0,""]
["",{"$nulls":5},"","","","",null,null,"","","",0,""]
["",{"$nulls":5},"","","","",null,null,"","","",0,""]
["",{"$nulls":5},"","","","",null,null,"","","",0,""]
["",{"$nulls":5},"","","","",null,null,"","","",0,""]
["",{"$nulls":5},"","","","",null,null,"","","",0,""]
["",{"$nulls":5},"","","","",null,null,"","","",0,""]
["",{"$nulls":5},"","","","",null,null,"","","",0,""]
["",{"$nulls":5},"","","","",null,null,"","","",0,""]
["",{"$nulls":5},"","","","",null,null,"","","",0,""]
["",{"$nulls":5},"","","","",null,null,"","","",0,""]
["",{"$nulls":5},"","","","",null,null,"","","",0,""]
["",{"$nulls":5},"","","","",null,null,"","","",0,""]
["",{"$nulls":5},"","","","",null,null,"","","",0,""]
["",{"$nulls":5},"","","","",null,null,"","","",0,""]
["",{"$nulls":5},"","","","",null,null,"","","",0,""]
["",{"$nulls":5},"","","","",null,null,"","","",0,""]
["",{"$nulls":5},"","","","",null,null,"","","",0,""]
["",{"$nulls":5},"","","","",null,null,"","","",0,""]
["",{"$nulls":5},"","","","",null,null,"","","",0,""]
["",{"$nulls":5},"","","","",null,null,"","","",0,""]
["",{"$nulls":5},"","","","",null,null,"","","",0,""]
["",{"$nulls":5},"","","","",null,null,"","","",0,""]
["",{"$nulls":5},"","","","",null,null,"","","",0,""]
["",{"$nulls":5},"","","","",null,null,"","","",0,""]
["",{"$nulls":5},"","","","",null,null,"","","",0,""]
["",{"$nulls":5},{"$f":"IF(ISBLANK(E206),\"\",ROUNDDOWN(E206/10,0))","v":""},{"$f":"IF(ISBLANK(E206),\"\",F206*100/E206)","v":""},{"$f":"IF(ISBLANK(E206),\"\",VLOOKUP(H206,$BT$2:$BW$7,4))","v":""},{"$f":"IF(ISBLANK(D206),\"\",IF(AND($J$11-D206<25),$J$11-D206,\"a. K.\"))","v":""},null,null,{"$f":"IF(ISBLANK(K206),\"\",ROUNDDOWN(K206/10,0))","v":""},{"$f":"IF(ISBLANK(K206),\"\",L206*100/K206)","v":""},{"$f":"IF(ISBLANK(K206),\"\",VLOOKUP(N206,$BT$2:$BW$7,4))","v":""},{"$f":"IF(AND(B206<>\"\",C206<>\"\",OR(E206>0,K206>0)),1,0)","v":0},{"$f":"IF(P206,$P$11,\"\")","v":""}]
["",{"$nulls":5},"","","","",null,null,"","","",0,""]
[{"$f":"IF(ISBLANK(B208),\"\",1+A207)","v":""},{"$nulls":5},"","","","",null,null,"","","",0,""]
["",{"$nulls":5},"","","","",null,null,"","","",0,""]
["",{"$nulls":5},"","","","",null,null,"","","",0,""]
["",{"$nulls":5},"","","","",null,null,"","","",0,""]
["",{"$nulls":5},"","","","",null,null,"","","",0,""]
["",{"$nulls":5},"","","","",null,null,"","","",0,""]
["",{"$nulls":5},"","","","",null,null,"","","",0,""]
["",{"$nulls":5},"","","","",null,null,"","","",0,""]
["",{"$nulls":5},"","","","",null,null,"","","",0,""]
["",{"$nulls":5},"","","","",null,null,"","","",0,""]
["",{"$nulls":5},"","","","",null,null,"","","",0,""]
["",{"$nulls":5},"","","","",null,null,"","","",0,""]
["",{"$nulls":5},"","","","",null,null,"","","",0,""]
["",{"$nulls":5},"","","","",null,null,"","","",0,""]
["",{"$nulls":5},"","","","",null,null,"","","",0,""]
["",{"$nulls":5},"","","","",null,null,"","","",0,""]
["",{"$nulls":5},"","","","",null,null,"","","",0,""]
["",{"$nulls":5},"","","","",null,null,"","","",0,""]
["",{"$nulls":5},"","","","",null,null,"","","",0,""]
["",{"$nulls":5},"","","","",null,null,"","","",0,""]
["",{"$nulls":5},"","","","",null,null,"","","",0,""]
["",{"$nulls":5},"","","","",null,null,"","","",0,""]
["",{"$nulls":5},"","","","",null,null,"","","",0,""]
["",{"$nulls":5},"","","","",null,null,"","","",0,""]
["",{"$nulls":5},"","","","",null,null,"","","",0,""]
["",{"$nulls":5},"","","","",null,null,"","","",0,""]
["",{"$nulls":5},"","","","",null,null,"","","",0,""]
["",{"$nulls":5},"","","","",null,null,"","","",0,""]
["",{"$nulls":5},"","","","",null,null,"","","",0,""]
["",{"$nulls":5},"","","","",null,null,"","","",0,""]
["",{"$nulls":5},"","","","",null,null,"","","",0,""]
["",{"$nulls":5},"","","","",null,null,"","","",0,""]
["",{"$nulls":5},"","","","",null,null,"","","",0,""]
["",{"$nulls":5},"","","","",null,null,"","","",0,""]
["",{"$nulls":5},"","","","",null,null,"","","",0,""]
["",{"$nulls":5},"","","","",null,null,"","","",0,""]
["",{"$nulls":5},"","","","",null,null,"","","",0,""]
["",{"$nulls":5},"","","","",null,null,"","","",0,""]
["",{"$nulls":5},"","","","",null,null,"","","",0,""]
["",{"$nulls":5},"","","","",null,null,"","","",0,""]
["",{"$nulls":5},"","","","",null,null,"","","",0,""]
["",{"$nulls":5},"","","","",null,null,"","","",0,""]
["",{"$nulls":5},"","","","",null,null,"","","",0,""]
["",{"$nulls":5},"","","","",null,null,"","","",0,""]
["",{"$nulls":5},"","","","",null,null,"","","",0,""]
["",{"$nulls":5},"","","","",null,null,"","","",0,""]
["",{"$nulls":5},"","","","",null,null,"","","",0,""]
["",{"$nulls":5},"","","","",null,null,"","","",0,""]
["",{"$nulls":5},"","","","",null,null,"","","",0,""]
["",{"$nulls":5},"","","","",null,null,"","","",0,""]
["",{"$nulls":5},"","","","",null,null,"","","",0,""]
["",{"$nulls":5},"","","","",null,null,"","","",0,""]
["",{"$nulls":5},"","","","",null,null,"","","",0,""]
["",{"$nulls":5},"","","","",null,null,"","","",0,""]
["",{"$nulls":5},"","","","",null,null,"","","",0,""]
["",{"$nulls":5},"","","","",null,null,"","","",0,""]
["",{"$nulls":5},"","","","",null,null,"","","",0,""]
["",{"$nulls":5},"","","","",null,null,"","","",0,""]
["",{"$nulls":5},"","","","",null,null,"","","",0,""]
["",{"$nulls":5},"","","","",null,null,"","","",0,""]
["",{"$nulls":5},"","","","",null,null,"","","",0,""]
["",{"$nulls":5},"","","","",null,null,"","","",0,""]
["",{"$nulls":5},{"$f":"IF(ISBLANK(E270),\"\",ROUNDDOWN(E270/10,0))","v":""},{"$f":"IF(ISBLANK(E270),\"\",F270*100/E270)","v":""},{"$f":"IF(ISBLANK(E270),\"\",VLOOKUP(H270,$BT$2:$BW$7,4))","v":""},{"$f":"IF(ISBLANK(D270),\"\",IF(AND($J$11-D270<25),$J$11-D270,\"a. K.\"))","v":""},null,null,{"$f":"IF(ISBLANK(K270),\"\",ROUNDDOWN(K270/10,0))","v":""},{"$f":"IF(ISBLANK(K270),\"\",L270*100/K270)","v":""},{"$f":"IF(ISBLANK(K270),\"\",VLOOKUP(N270,$BT$2:$BW$7,4))","v":""},{"$f":"IF(AND(B270<>\"\",C270<>\"\",OR(E270>0,K270>0)),1,0)","v":0},{"$f":"IF(P270,$P$11,\"\")","v":""}]
["",{"$nulls":5},"","","","",null,null,"","","",0,""]
[{"$f":"IF(ISBLANK(B272),\"\",1+A271)","v":""},{"$nulls":5},"","","","",null,null,"","","",0,""]
["",{"$nulls":5},"","","","",null,null,"","","",0,""]
["",{"$nulls":5},"","","","",null,null,"","","",0,""]
["",{"$nulls":5},"","","","",null,null,"","","",0,""]
["",{"$nulls":5},"","","","",null,null,"","","",0,""]
["",{"$nulls":5},"","","","",null,null,"","","",0,""]
["",{"$nulls":5},"","","","",null,null,"","","",0,""]
["",{"$nulls":5},"","","","",null,null,"","","",0,""]
["",{"$nulls":5},"","","","",null,null,"","","",0,""]
["",{"$nulls":5},"","","","",null,null,"","","",0,""]
["",{"$nulls":5},"","","","",null,null,"","","",0,""]
["",{"$nulls":5},"","","","",null,null,"","","",0,""]
["",{"$nulls":5},"","","","",null,null,"","","",0,""]
["",{"$nulls":5},"","","","",null,null,"","","",0,""]
["",{"$nulls":5},"","","","",null,null,"","","",0,""]
["",{"$nulls":5},"","","","",null,null,"","","",0,""]
["",{"$nulls":5},"","","","",null,null,"","","",0,""]
["",{"$nulls":5},"","","","",null,null,"","","",0,""]
["",{"$nulls":5},"","","","",null,null,"","","",0,""]
["",{"$nulls":5},"","","","",null,null,"","","",0,""]
["",{"$nulls":5},"","","","",null,null,"","","",0,""]
["",{"$nulls":5},"","","","",null,null,"","","",0,""]
["",{"$nulls":5},"","","","",null,null,"","","",0,""]
["",{"$nulls":5},"","","","",null,null,"","","",0,""]
["",{"$nulls":5},"","","","",null,null,"","","",0,""]
["",{"$nulls":5},"","","","",null,null,"","","",0,""]
["",{"$nulls":5},"","","","",null,null,"","","",0,""]
["",{"$nulls":5},"","","","",null,null,"","","",0,""]
["",{"$nulls":5},"","","","",null,null,"","","",0,""]
["",{"$nulls":5},"","","","",null,null,"","","",0,""]
["",{"$nulls":5},"","","","",null,null,"","","",0,""]
["",{"$nulls":5},"","","","",null,null,"","","",0,""]
["",{"$nulls":5},"","","","",null,null,"","","",0,""]
["",{"$nulls":5},"","","","",null,null,"","","",0,""]
["",{"$nulls":5},"","","","",null,null,"","","",0,""]
["",{"$nulls":5},"","","","",null,null,"","","",0,""]
["",{"$nulls":5},"","","","",null,null,"","","",0,""]
["",{"$nulls":5},"","","","",null,null,"","","",0,""]
["",{"$nulls":5},"","","","",null,null,"","","",0,""]
["",{"$nulls":5},"","","","",null,null,"","","",0,""]
["",{"$nulls":5},"","","","",null,null,"","","",0,""]
["",{"$nulls":5},"","","","",null,null,"","","",0,""]
["",{"$nulls":5},"","","","",null,null,"","","",0,""]
["",{"$nulls":5},"","","","",null,null,"","","",0,""]
["",{"$nulls":5},"","","","",null,null,"","","",0,""]
["",{"$nulls":5},"","","","",null,null,"","","",0,""]
["",{"$nulls":5},"","","","",null,null,"","","",0,""]
["",{"$nulls":5},"","","","",null,null,"","","",0,""]
["",{"$nulls":5},"","","","",null,null,"","","",0,""]
["",{"$nulls":5},"","","","",null,null,"","","",0,""]
["",{"$nulls":5},"","","","",null,null,"","","",0,""]
["",{"$nulls":5},"","","","",null,null,"","","",0,""]
["",{"$nulls":5},"","","","",null,null,"","","",0,""]
["",{"$nulls":5},"","","","",null,null,"","","",0,""]
["",{"$nulls":5},"","","","",null,null,"","","",0,""]
["",{"$nulls":5},"","","","",null,null,"","","",0,""]
["",{"$nulls":5},"","","","",null,null,"","","",0,""]
["",{"$nulls":5},"","","","",null,null,"","","",0,""]
["",{"$nulls":5},"","","","",null,null,"","","",0,""]
["",{"$nulls":5},"","","","",null,null,"","","",0,""]
["",{"$nulls":5},"","","","",null,null,"","","",0,""]
["",{"$nulls":5},"","","","",null,null,"","","",0,""]
["",{"$nulls":5},{"$f":"IF(ISBLANK(E334),\"\",ROUNDDOWN(E334/10,0))","v":""},{"$f":"IF(ISBLANK(E334),\"\",F334*100/E334)","v":""},{"$f":"IF(ISBLANK(E334),\"\",VLOOKUP(H334,$BT$2:$BW$7,4))","v":""},{"$f":"IF(ISBLANK(D334),\"\",IF(AND($J$11-D334<25),$J$11-D334,\"a. K.\"))","v":""},null,null,{"$f":"IF(ISBLANK(K334),\"\",ROUNDDOWN(K334/10,0))","v":""},{"$f":"IF(ISBLANK(K334),\"\",L334*100/K334)","v":""},{"$f":"IF(ISBLANK(K334),\"\",VLOOKUP(N334,$BT$2:$BW$7,4))","v":""},{"$f":"IF(AND(B334<>\"\",C334<>\"\",OR(E334>0,K334>0)),1,0)","v":0},{"$f":"IF(P334,$P$11,\"\")","v":""}]
["",{"$nulls":5},"","","","",null,null,"","","",0,""]
[{"$f":"IF(ISBLANK(B336),\"\",1+A335)","v":""},{"$nulls":5},"","","","",null,null,"","","",0,""]
["",{"$nulls":5},"","","","",null,null,"","","",0,""]
["",{"$nulls":5},"","","","",null,null,"","","",0,""]
["",{"$nulls":5},"","","","",null,null,"","","",0,""]
["",{"$nulls":5},"","","","",null,null,"","","",0,""]
["",{"$nulls":5},"","","","",null,null,"","","",0,""]
["",{"$nulls":5},"","","","",null,null,"","","",0,""]
["",{"$nulls":5},"","","","",null,null,"","","",0,""]
["",{"$nulls":5},"","","","",null,null,"","","",0,""]
["",{"$nulls":5},"","","","",null,null,"","","",0,""]
["",{"$nulls":5},"","","","",null,null,"","","",0,""]
["",{"$nulls":5},"","","","",null,null,"","","",0,""]
["",{"$nulls":5},"","","","",null,null,"","","",0,""]
["",{"$nulls":5},"","","","",null,null,"","","",0,""]
["",{"$nulls":5},"","","","",null,null,"","","",0,""]
["",{"$nulls":5},"","","","",null,null,"","","",0,""]
["",{"$nulls":5},"","","","",null,null,"","","",0,""]
["",{"$nulls":5},"","","","",null,null,"","","",0,""]
["",{"$nulls":5},"","","","",null,null,"","","",0,""]
["",{"$nulls":5},"","","","",null,null,"","","",0,""]
["",{"$nulls":5},"","","","",null,null,"","","",0,""]
["",{"$nulls":5},"","","","",null,null,"","","",0,""]
["",{"$nulls":5},"","","","",null,null,"","","",0,""]
["",{"$nulls":5},"","","","",null,null,"","","",0,""]
["",{"$nulls":5},"","","","",null,null,"","","",0,""]
["",{"$nulls":5},"","","","",null,null,"","","",0,""]
["",{"$nulls":5},"","","","",null,null,"","","",0,""]
["",{"$nulls":5},"","","","",null,null,"","","",0,""]
["",{"$nulls":5},"","","","",null,null,"","","",0,""]
["",{"$nulls":5},"","","","",null,null,"","","",0,""]
["",{"$nulls":5},"","","","",null,null,"","","",0,""]
["",{"$nulls":5},"","","","",null,null,"","","",0,""]
["",{"$nulls":5},"","","","",null,null,"","","",0,""]
["",{"$nulls":5},"","","","",null,null,"","","",0,""]
["",{"$nulls":5},"","","","",null,null,"","","",0,""]
["",{"$nulls":5},"","","","",null,null,"","","",0,""]
["",{"$nulls":5},"","","","",null,null,"","","",0,""]
["",{"$nulls":5},"","","","",null,null,"","","",0,""]
["",{"$nulls":5},"","","","",null,null,"","","",0,""]
["",{"$nulls":5},"","","","",null,null,"","","",0,""]
["",{"$nulls":5},"","","","",null,null,"","","",0,""]
["",{"$nulls":5},"","","","",null,null,"","","",0,""]
["",{"$nulls":5},"","","","",null,null,"","","",0,""]
["",{"$nulls":5},"","","","",null,null,"","","",0,""]
["",{"$nulls":5},"","","","",null,null,"","","",0,""]
["",{"$nulls":5},"","","","",null,null,"","","",0,""]
["",{"$nulls":5},"","","","",null,null,"","","",0,""]
["",{"$nulls":5},"","","","",null,null,"","","",0,""]
["",{"$nulls":5},"","","","",null,null,"","","",0,""]
["",{"$nulls":5},"","","","",null,null,"","","",0,""]
["",{"$nulls":5},"","","","",null,null,"","","",0,""]
["",{"$nulls":5},"","","","",null,null,"","","",0,""]
["",{"$nulls":5},"","","","",null,null,"","","",0,""]
["",{"$nulls":5},"","","","",null,null,"","","",0,""]
["",{"$nulls":5},"","","","",null,null,"","","",0,""]
["",{"$nulls":5},"","","","",null,null,"","","",0,""]
["",{"$nulls":5},"","","","",null,null,"","","",0,""]
["",{"$nulls":5},"","","","",null,null,"","","",0,""]
["",{"$nulls":5},"","","","",null,null,"","","",0,""]
["",{"$nulls":5},"","","","",null,null,"","","",0,""]
["",{"$nulls":5},"","","","",null,null,"","","",0,""]
["",{"$nulls":5},"","","","",null,null,"","","",0,""]
["",{"$nulls":5},{"$f":"IF(ISBLANK(E398),\"\",ROUNDDOWN(E398/10,0))","v":""},{"$f":"IF(ISBLANK(E398),\"\",F398*100/E398)","v":""},{"$f":"IF(ISBLANK(E398),\"\",VLOOKUP(H398,$BT$2:$BW$7,4))","v":""},{"$f":"IF(ISBLANK(D398),\"\",IF(AND($J$11-D398<25),$J$11-D398,\"a. K.\"))","v":""},null,null,{"$f":"IF(ISBLANK(K398),\"\",ROUNDDOWN(K398/10,0))","v":""},{"$f":"IF(ISBLANK(K398),\"\",L398*100/K398)","v":""},{"$f":"IF(ISBLANK(K398),\"\",VLOOKUP(N398,$BT$2:$BW$7,4))","v":""},{"$f":"IF(AND(B398<>\"\",C398<>\"\",OR(E398>0,K398>0)),1,0)","v":0},{"$f":"IF(P398,$P$11,\"\")","v":""}]
["",{"$nulls":5},"","","","",null,null,"","","",0,""]
[{"$f":"IF(ISBLANK(B400),\"\",1+A399)","v":""},{"$nulls":5},"","","","",null,null,"","","",0,""]
["",{"$nulls":5},"","","","",null,null,"","","",0,""]
["",{"$nulls":5},"","","","",null,null,"","","",0,""]
["",{"$nulls":5},"","","","",null,null,"","","",0,""]
["",{"$nulls":5},"","","","",null,null,"","","",0,""]
["",{"$nulls":5},"","","","",null,null,"","","",0,""]
["",{"$nulls":5},"","","","",null,null,"","","",0,""]
["",{"$nulls":5},"","","","",null,null,"","","",0,""]
["",{"$nulls":5},"","","","",null,null,"","","",0,""]
["",{"$nulls":5},"","","","",null,null,"","","",0,""]
["",{"$nulls":5},"","","","",null,null,"","","",0,""]
["",{"$nulls":5},"","","","",null,null,"","","",0,""]
["",{"$nulls":5},"","","","",null,null,"","","",0,""]
["",{"$nulls":5},"","","","",null,null,"","","",0,""]
["",{"$nulls":5},"","","","",null,null,"","","",0,""]
["",{"$nulls":5},"","","","",null,null,"","","",0,""]
["",{"$nulls":5},"","","","",null,null,"","","",0,""]
["",{"$nulls":5},"","","","",null,null,"","","",0,""]
["",{"$nulls":5},"","","","",null,null,"","","",0,""]
["",{"$nulls":5},"","","","",null,null,"","","",0,""]
["",{"$nulls":5},"","","","",null,null,"","","",0,""]
["",{"$nulls":5},"","","","",null,null,"","","",0,""]
["",{"$nulls":5},"","","","",null,null,"","","",0,""]
["",{"$nulls":5},"","","","",null,null,"","","",0,""]
["",{"$nulls":5},"","","","",null,null,"","","",0,""]
["",{"$nulls":5},"","","","",null,null,"","","",0,""]
["",{"$nulls":5},"","","","",null,null,"","","",0,""]
["",{"$nulls":5},"","","","",null,null,"","","",0,""]
["",{"$nulls":5},"","","","",null,null,"","","",0,""]
["",{"$nulls":5},"","","","",null,null,"","","",0,""]
["",{"$nulls":5},"","","","",null,null,"","","",0,""]
["",{"$nulls":5},"","","","",null,null,"","","",0,""]
["",{"$nulls":5},"","","","",null,null,"","","",0,""]
["",{"$nulls":5},"","","","",null,null,"","","",0,""]
["",{"$nulls":5},"","","","",null,null,"","","",0,""]
["",{"$nulls":5},"","","","",null,null,"","","",0,""]
["",{"$nulls":5},"","","","",null,null,"","","",0,""]
["",{"$nulls":5},"","","","",null,null,"","","",0,""]
["",{"$nulls":5},"","","","",null,null,"","","",0,""]
["",{"$nulls":5},"","","","",null,null,"","","",0,""]
["",{"$nulls":5},"","","","",null,null,"","","",0,""]
["",{"$nulls":5},"","","","",null,null,"","","",0,""]
["",{"$nulls":5},"","","","",null,null,"","","",0,""]
["",{"$nulls":5},"","","","",null,null,"","","",0,""]
["",{"$nulls":5},"","","","",null,null,"","","",0,""]
["",{"$nulls":5},"","","","",null,null,"","","",0,""]
["",{"$nulls":5},"","","","",null,null,"","","",0,""]
["",{"$nulls":5},"","","","",null,null,"","","",0,""]
["",{"$nulls":5},"","","","",null,null,"","","",0,""]
["",{"$nulls":5},"","","","",null,null,"","","",0,""]
["",{"$nulls":5},"","","","",null,null,"","","",0,""]
["",{"$nulls":5},"","","","",null,null,"","","",0,""]
["",{"$nulls":5},"","","","",null,null,"","","",0,""]
["",{"$nulls":5},"","","","",null,null,"","","",0,""]
["",{"$nulls":5},"","","","",null,null,"","","",0,""]
["",{"$nulls":5},"","","","",null,null,"","","",0,""]
["",{"$nulls":5},"","","","",null,null,"","","",0,""]
["",{"$nulls":5},"","","","",null,null,"","","",0,""]
["",{"$nulls":5},"","","","",null,null,"","","",0,""]
["",{"$nulls":5},"","","","",null,null,"","","",0,""]
["",{"$nulls":5},"","","","",null,null,"","","",0,""]
["",{"$nulls":5},"","","","",null,null,"","","",0,""]
["",{"$nulls":5},{"$f":"IF(ISBLANK(E462),\"\",ROUNDDOWN(E462/10,0))","v":""},{"$f":"IF(ISBLANK(E462),\"\",F462*100/E462)","v":""},{"$f":"IF(ISBLANK(E462),\"\",VLOOKUP(H462,$BT$2:$BW$7,4))","v":""},{"$f":"IF(ISBLANK(D462),\"\",IF(AND($J$11-D462<25),$J$11-D462,\"a. K.\"))","v":""},null,null,{"$f":"IF(ISBLANK(K462),\"\",ROUNDDOWN(K462/10,0))","v":""},{"$f":"IF(ISBLANK(K462),\"\",L462*100/K462)","v":""},{"$f":"IF(ISBLANK(K462),\"\",VLOOKUP(N462,$BT$2:$BW$7,4))","v":""},{"$f":"IF(AND(B462<>\"\",C462<>\"\",OR(E462>0,K462>0)),1,0)","v":0},{"$f":"IF(P462,$P$11,\"\")","v":""}]
["",{"$nulls":5},"","","","",null,null,"","","",0,""]
[{"$f":"IF(ISBLANK(B464),\"\",1+A463)","v":""},{"$nulls":5},"","","","",null,null,"","","",0,""]
["",{"$nulls":5},"","","","",null,null,"","","",0,""]
["",{"$nulls":5},"","","","",null,null,"","","",0,""]
["",{"$nulls":5},"","","","",null,null,"","","",0,""]
["",{"$nulls":5},"","","","",null,null,"","","",0,""]
["",{"$nulls":5},"","","","",null,null,"","","",0,""]
["",{"$nulls":5},"","","","",null,null,"","","",0,""]
["",{"$nulls":5},"","","","",null,null,"","","",0,""]
["",{"$nulls":5},"","","","",null,null,"","","",0,""]
["",{"$nulls":5},"","","","",null,null,"","","",0,""]
["",{"$nulls":5},"","","","",null,null,"","","",0,""]
["",{"$nulls":5},"","","","",null,null,"","","",0,""]
["",{"$nulls":5},"","","","",null,null,"","","",0,""]
["",{"$nulls":5},"","","","",null,null,"","","",0,""]
["",{"$nulls":5},"","","","",null,null,"","","",0,""]
["",{"$nulls":5},"","","","",null,null,"","","",0,""]
["",{"$nulls":5},"","","","",null,null,"","","",0,""]
["",{"$nulls":5},"","","","",null,null,"","","",0,""]
["",{"$nulls":5},"","","","",null,null,"","","",0,""]
["",{"$nulls":5},"","","","",null,null,"","","",0,""]
["",{"$nulls":5},"","","","",null,null,"","","",0,""]
["",{"$nulls":5},"","","","",null,null,"","","",0,""]
["",{"$nulls":5},"","","","",null,null,"","","",0,""]
["",{"$nulls":5},"","","","",null,null,"","","",0,""]
["",{"$nulls":5},"","","","",null,null,"","","",0,""]
["",{"$nulls":5},"","","","",null,null,"","","",0,""]
["",{"$nulls":5},"","","","",null,null,"","","",0,""]
["",{"$nulls":5},"","","","",null,null,"","","",0,""]
["",{"$nulls":5},"","","","",null,null,"","","",0,""]
["",{"$nulls":5},"","","","",null,null,"","","",0,""]
["",{"$nulls":5},"","","","",null,null,"","","",0,""]
["",{"$nulls":5},"","","","",null,null,"","","",0,""]
["",{"$nulls":5},"","","","",null,null,"","","",0,""]
["",{"$nulls":5},"","","","",null,null,"","","",0,""]
["",{"$nulls":5},"","","","",null,null,"","","",0,""]
["",{"$nulls":5},"","","","",null,null,"","","",0,""]
["",{"$nulls":5},"","","","",null,null,"","","",0,""]
["",{"$nulls":5},"","","","",null,null,"","","",0,""]
[{"$f":"IF(ISBLANK(B502),\"\",1+A501)","v":""},{"$nulls":5},"","","","",null,null,"","","",0,""]
[{"$f":"IF(ISBLANK(B503),\"\",1+A502)","v":""},{"$nulls":5},"","","","",null,null,"","","",0,""]
[{"$f":"IF(ISBLANK(B504),\"\",1+A503)","v":""},{"$nulls":5},"","","","",null,null,"","","",0,""]